blob: ef897c828ee05c6cc971e73dd92f05900dba3d78 [file] [log] [blame]
2021-10-13 Eric Hutchison <ehutchison@apple.com>
[ iOS15 ] fast/scrolling/ios/click-events-during-momentum-scroll-in-overflow.html is a flaky timeout.
https://bugs.webkit.org/show_bug.cgi?id=231714.
Unreviewed test gardening.
* platform/ios-wk2/TestExpectations:
2021-10-13 Patrick Angle <pangle@apple.com>
HTTP method in web inspector network tab is not what WebKit actually sent after a redirect from POST to GET
https://bugs.webkit.org/show_bug.cgi?id=222558
Reviewed by Michael Catanzaro.
Test that redirect requests and responses have the appropriate method and status code and the correct number of
redirect records were created.
* http/tests/inspector/network/resource-redirect-request-headers-expected.txt: Added.
* http/tests/inspector/network/resource-redirect-request-headers.html: Added.
2021-10-13 Megan Gardner <megan_gardner@apple.com>
Remove adjustForIOSCaretWhenScrolling() code
https://bugs.webkit.org/show_bug.cgi?id=230454
Reviewed by Simon Fraser.
Rebase tests with the unified code path.
* platform/ios-wk2/editing/input/caret-at-the-edge-of-input-expected.txt:
* platform/ios-wk2/fast/layers/scroll-rect-to-visible-expected.txt:
* platform/ios/fast/forms/input-text-scroll-left-on-blur-expected.txt:
* platform/ios/fast/forms/textfield-outline-expected.txt:
2021-10-13 Ayumi Kojima <ayumi_kojima@apple.com>
[ Windows EWS ] js/dom & js/dfg- tests are a flaky crash.
https://bugs.webkit.org/show_bug.cgi?id=231703
Unreviewed test gardening.
* platform/win/TestExpectations:
2021-10-13 Alan Bujtas <zalan@apple.com>
[LFC][IFC] Preserved tab is not a word separator
https://bugs.webkit.org/show_bug.cgi?id=231687
Reviewed by Antti Koivisto.
* fast/text/preserved-white-space-with-word-spacing-expected.html: Added.
* fast/text/preserved-white-space-with-word-spacing.html: Added.
2021-10-13 Jean-Yves Avenard <jya@apple.com>
Add mp3 and aac web audio test
https://bugs.webkit.org/show_bug.cgi?id=231643
rdar://problem/84178398
Add MP3 / AAC webaudio decodeAudioData tests.
Existing tests were disabled by default, likely due to
https://bugs.webkit.org/show_bug.cgi?id=230974
Reviewed by Eric Carlson.
* platform/mac/TestExpectations:
* platform/wk2/TestExpectations:
* webaudio/decode-audio-data-basic-expected.txt:
* webaudio/decode-audio-data-basic.html:
2021-10-13 Sihui Liu <sihui_liu@apple.com>
Implement FileSystemHandle move()
https://bugs.webkit.org/show_bug.cgi?id=231676
<rdar://problem/84199823>
Reviewed by Youenn Fablet.
* storage/filesystemaccess/handle-move-expected.txt: Added.
* storage/filesystemaccess/handle-move-worker-expected.txt: Added.
* storage/filesystemaccess/handle-move-worker.html: Added.
* storage/filesystemaccess/handle-move.html: Added.
* storage/filesystemaccess/resources/handle-move.js: Added.
(finishTest):
(async test):
2021-10-13 Fujii Hironori <Hironori.Fujii@sony.com>
[WinCairo] Unreviewed test gardening
* platform/wincairo/TestExpectations:
2021-10-13 Eric Hutchison <ehutchison@apple.com>
Update test expectations for fast/events/ios/dom-update-on-keydown-quirk.html.
https://bugs.webkit.org/show_bug.cgi?id=230509.
Unreviewed test gardening.
* platform/ios-14-wk2/TestExpectations:
* platform/ios-wk2/TestExpectations:
2021-10-13 Ayumi Kojima <ayumi_kojima@apple.com>
[ Windows EWS ] fast/text/hanging-punctuation-allow-end-basic.html is image failing.
https://bugs.webkit.org/show_bug.cgi?id=231690
Unreviewed test gardening.
* platform/win/TestExpectations:
2021-10-13 Tim Nguyen <ntim@apple.com>
Implement <dialog> focusing steps
https://bugs.webkit.org/show_bug.cgi?id=227537
Reviewed by Darin Adler.
https://html.spec.whatwg.org/multipage/interactive-elements.html#dialog-focusing-steps
* platform/ios-wk2/imported/w3c/web-platform-tests/html/semantics/interactive-elements/the-dialog-element/dialog-cancel-with-select-expected.txt: Added (test_driver.send_keys not working on iOS)
2021-10-13 Aditya Keerthi <akeerthi@apple.com>
[macOS] Add support for accent-color
https://bugs.webkit.org/show_bug.cgi?id=231464
rdar://84049511
Reviewed by Tim Horton.
Added ref tests for accent-color. These are not WPT, since the spec does
not specify which controls accent-color applies to.
* TestExpectations:
* fast/css/accent-color/checkbox-expected-mismatch.html: Added.
* fast/css/accent-color/checkbox.html: Added.
* fast/css/accent-color/datalist-expected-mismatch.html: Added.
* fast/css/accent-color/datalist.html: Added.
* fast/css/accent-color/progress-expected-mismatch.html: Added.
* fast/css/accent-color/progress.html: Added.
* fast/css/accent-color/radio-expected-mismatch.html: Added.
* fast/css/accent-color/radio.html: Added.
* fast/css/accent-color/range-expected-mismatch.html: Added.
* fast/css/accent-color/range.html: Added.
* fast/css/accent-color/select-expected-mismatch.html: Added.
* fast/css/accent-color/select.html: Added.
* fast/css/accent-color/text-expected.html: Added.
* fast/css/accent-color/text.html: Added.
* platform/mac/TestExpectations:
2021-10-13 Eric Hutchison <ehutchison@apple.com>
[ iOS15 Catalina Debug ] requestidlecallback/requestidlecallback-document-gc.html is a flaky crash.
https://bugs.webkit.org/show_bug.cgi?id=231684.
Unreviewed test gardening.
* platform/ios-wk2/TestExpectations:
* platform/mac-wk1/TestExpectations:
2021-10-13 Chris Dumez <cdumez@apple.com>
MessagePort messages sent in iframe unload event not received
https://bugs.webkit.org/show_bug.cgi?id=231167
<rdar://problem/84095357>
Reviewed by Alex Christensen.
Add layout test coverage.
* fast/frames/message-port-postMessage-unload-event-expected.txt: Added.
* fast/frames/message-port-postMessage-unload-event.html: Added.
2021-10-13 Ayumi Kojima <ayumi_kojima@apple.com>
[ iOS MacOS wk2 Release ] 2 fast/canvas tests are flaky failing.
https://bugs.webkit.org/show_bug.cgi?id=231681
Unreviewed test gardening.
* platform/ios-wk2/TestExpectations:
* platform/mac-wk2/TestExpectations:
2021-10-13 Aditya Keerthi <akeerthi@apple.com>
Unprefix -webkit-appearance
https://bugs.webkit.org/show_bug.cgi?id=231534
rdar://84112934
Reviewed by Wenson Hsieh.
* TestExpectations:
Mark two tests ref tests as failing. These tests were incorrectly passing
due to lack of support for 'appearance'. The tests use <compat-auto> values
which we do not yet support due to compat risk with internal apps. These
tests will be addressed on a case-by-case basis.
* fast/css/getComputedStyle/computed-style-expected.txt:
* fast/css/getComputedStyle/computed-style-without-renderer-expected.txt:
* fast/css/getComputedStyle/resources/property-names.js:
* platform/glib/fast/css/getComputedStyle/computed-style-expected.txt:
* platform/glib/fast/css/getComputedStyle/computed-style-without-renderer-expected.txt:
* platform/glib/svg/css/getComputedStyle-basic-expected.txt:
* platform/gtk/imported/w3c/web-platform-tests/css/cssom/cssstyledeclaration-csstext-expected.txt:
* platform/ios-wk2/imported/w3c/web-platform-tests/css/css-ui/appearance-cssom-001-expected.txt:
* platform/ios-wk2/imported/w3c/web-platform-tests/css/cssom/cssstyledeclaration-csstext-expected.txt:
* platform/ios-wk2/imported/w3c/web-platform-tests/html/rendering/widgets/appearance/default-styles-expected.txt:
* platform/ios/fast/css/getComputedStyle/computed-style-expected.txt:
* platform/ios/fast/css/getComputedStyle/computed-style-without-renderer-expected.txt:
* platform/ios/imported/w3c/web-platform-tests/css/cssom/cssstyledeclaration-csstext-expected.txt:
* platform/ios/svg/css/getComputedStyle-basic-expected.txt:
* platform/mac-wk1/imported/w3c/web-platform-tests/html/rendering/widgets/appearance/default-styles-expected.txt:
* platform/mac/fast/css/getComputedStyle/computed-style-expected.txt:
* platform/mac/fast/css/getComputedStyle/computed-style-without-renderer-expected.txt:
* platform/mac/svg/css/getComputedStyle-basic-expected.txt:
* platform/wpe/imported/w3c/web-platform-tests/css/cssom/cssstyledeclaration-csstext-expected.txt:
* svg/css/getComputedStyle-basic-expected.txt:
2021-10-13 Simon Fraser <simon.fraser@apple.com>
[WK1] Tests for smooth scrolling of a window fail
https://bugs.webkit.org/show_bug.cgi?id=191357
Reviewed by Sam Weinig.
Some cssom-view tests pass now in WK1.
* platform/mac-wk1/TestExpectations:
2021-10-13 Alan Bujtas <zalan@apple.com>
[LFC][IFC] Do not break at the inline box boundary when wrapping is not allowed
https://bugs.webkit.org/show_bug.cgi?id=231581
Reviewed by Antti Koivisto.
* fast/inline/no-soft-wrap-opportunity-at-inline-box-expected.html: Added.
* fast/inline/no-soft-wrap-opportunity-at-inline-box.html: Added.
2021-10-13 Alicia Boya García <aboya@igalia.com>
Unreviewed, reverting r283609
Build failure with GStreamer 1.14 and regression causing frame
corruption.
Reverted changeset:
"[MSE][GStreamer] Honor MP4 edit lists"
https://bugs.webkit.org/show_bug.cgi?id=231019
https://commits.webkit.org/r283609
2021-10-13 Youenn Fablet <youenn@apple.com>
Add support for WebRTC media capabilities
https://bugs.webkit.org/show_bug.cgi?id=231568
Reviewed by Eric Carlson.
* media/mediacapabilities/mock-encodingInfo-expected.txt:
* media/mediacapabilities/mock-encodingInfo.html:
* platform/ios/media/mediacapabilities/mediacapabilities-encodingInfo-undefined-expected.txt: Removed.
* platform/ios/media/mediacapabilities/mediacapabilities-encodingInfo-undefined.html: Removed.
* platform/ios/media/mediacapabilities/mediacapabilities-types-expected.txt: Removed.
* platform/mac/media/mediacapabilities/mediacapabilities-types-expected.txt: Removed.
* platform/mac/media/mediacapabilities/mediacapabilities-encodingInfo-undefined-expected.txt: Removed.
* platform/mac/media/mediacapabilities/mediacapabilities-encodingInfo-undefined.html: Removed.
* platform/mac/media/mediacapabilities/mediacapabilities-types-expected.txt:
* tests-options.json:
2021-10-13 Martin Robinson <mrobinson@webkit.org>
Sticky element inside another sticky element does not redraw properly on scroll
https://bugs.webkit.org/show_bug.cgi?id=199915
<rdar://problem/53375284>
Reviewed by Simon Fraser.
When calculating layer position for sticky nodes in the scrolling tree, take into
account situations where the sticky parents of sticky nodes don't stick (due to
sizing). This was handled properly in layout, but not in the scrolling tree, which
caused these kinds of nodes to jump around.
* scrollingcoordinator/mac/nested-sticky-with-nonsticking-sticky-parent-expected.html: Added.
* scrollingcoordinator/mac/nested-sticky-with-nonsticking-sticky-parent.html: Added.
2021-10-12 Arcady Goldmints-Orlov <agoldmints@igalia.com>
[GTK] Update test expectations for CSS web platform tests.
https://bugs.webkit.org/show_bug.cgi?id=231632
Unreviewed test gardening.
* platform/gtk/TestExpectations:
* platform/gtk/fast/css/empty-inline-line-height-first-line-expected.txt: Added.
* platform/gtk/fast/css/empty-inline-line-height-first-line-quirksmode-expected.txt: Added.
* platform/gtk/fast/parser/entities-in-xhtml-expected.txt: Added.
2021-10-12 Kate Cheney <katherine_cheney@apple.com>
CSP: Implement unsafe-hashes
https://bugs.webkit.org/show_bug.cgi?id=231313
<rdar://problem/83724376>
Reviewed by Brent Fulgham.
Mostly updating blockedURI to be "inline" in the case of inline script
or style violations to match the CSP3 spec.
* TestExpectations:
javascript_src_allowed-href_blank.html times out because it can't find
opener.t1. This is unrelated to unsafe-hashes and seems to be another
bug in our DOM code.
* http/tests/security/contentSecurityPolicy/1.1/report-uri-effective-directive-expected.txt:
* http/tests/security/contentSecurityPolicy/1.1/scripthash-allowed-by-enforced-policy-and-blocked-by-report-policy-expected.txt:
* http/tests/security/contentSecurityPolicy/1.1/scripthash-allowed-by-enforced-policy-and-blocked-by-report-policy2-expected.txt:
* http/tests/security/contentSecurityPolicy/1.1/scripthash-allowed-by-legacy-enforced-policy-and-blocked-by-report-policy-expected.txt:
* http/tests/security/contentSecurityPolicy/1.1/scripthash-allowed-by-legacy-enforced-policy-and-blocked-by-report-policy2-expected.txt:
* http/tests/security/contentSecurityPolicy/1.1/scripthash-blocked-by-enforced-policy-and-allowed-by-report-policy-expected.txt:
* http/tests/security/contentSecurityPolicy/1.1/scripthash-blocked-by-legacy-enforced-policy-and-blocked-by-report-policy-expected.txt:
* http/tests/security/contentSecurityPolicy/1.1/scripthash-blocked-by-legacy-enforced-policy-and-blocked-by-report-policy2-expected.txt:
* http/tests/security/contentSecurityPolicy/1.1/scriptnonce-blocked-by-enforced-policy-and-allowed-by-report-policy-expected.txt:
* http/tests/security/contentSecurityPolicy/report-and-enforce-expected.txt:
* http/tests/security/contentSecurityPolicy/report-only-expected.txt:
* http/tests/security/contentSecurityPolicy/report-only-from-header-expected.txt:
* http/tests/security/contentSecurityPolicy/report-only-upgrade-insecure-expected.txt:
* http/tests/security/contentSecurityPolicy/report-status-code-zero-when-using-https-expected.txt:
* http/tests/security/contentSecurityPolicy/report-uri-expected.txt:
* http/tests/security/contentSecurityPolicy/report-uri-from-child-frame-expected.txt:
* http/tests/security/contentSecurityPolicy/report-uri-scheme-relative-expected.txt:
2021-10-12 Alan Bujtas <zalan@apple.com>
[LFC][IFC] Do not collapse whitespace with zero-width space separator in-between
https://bugs.webkit.org/show_bug.cgi?id=231595
Reviewed by Antti Koivisto.
* fast/text/whitespace-with-zero-width-space-in-between-expected.html: Added.
* fast/text/whitespace-with-zero-width-space-in-between.html: Added.
2021-10-12 Ayumi Kojima <ayumi_kojima@apple.com>
[ macOS wk1 ] imported/w3c/web-platform-tests/css/selectors/focus-visible-009.html is a flaky failure.
https://bugs.webkit.org/show_bug.cgi?id=231647
Unreviewed test gardening.
* platform/mac-wk1/TestExpectations:
2021-10-12 Alan Bujtas <zalan@apple.com>
[LFC][IFC] LazyLineBreakIterator should be correctly setup for the prior context case
https://bugs.webkit.org/show_bug.cgi?id=231608
Reviewed by Antti Koivisto.
* fast/inline/line-break-loose-with-inline-box-boundary-expected.html: Added.
* fast/inline/line-break-loose-with-inline-box-boundary.html: Added.
2021-10-12 Sihui Liu <sihui_liu@apple.com>
Implement FileSystemSyncAccessHandle read() and write()
https://bugs.webkit.org/show_bug.cgi?id=231466
<rdar://problem/84050394>
Reviewed by Youenn Fablet.
* storage/filesystemaccess/resources/sync-access-handle-read-write.js: Added.
(finishTest):
(arrayBufferToString):
(stringToArrayBuffer):
(write):
(read):
(async test):
* storage/filesystemaccess/sync-access-handle-read-write-worker-expected.txt: Added.
* storage/filesystemaccess/sync-access-handle-read-write-worker.html: Added.
2021-10-12 Ayumi Kojima <ayumi_kojima@apple.com>
[ iOS, Mac ] imported/w3c/web-platform-tests/css/css-cascade/layer-counter-style-override.html is a flaky failure.
https://bugs.webkit.org/show_bug.cgi?id=230905
Unreviewed test gardening.
* platform/mac-wk1/TestExpectations:
2021-10-12 Ayumi Kojima <ayumi_kojima@apple.com>
[ iOS ] fast/scrolling/ios/scroll-snap-with-momentum-scroll-in-overflow-scroll-area.html is a flaky failure.
https://bugs.webkit.org/show_bug.cgi?id=231641
Unreviewed test gardening.
* platform/ios-wk2/TestExpectations:
2021-10-12 Eric Hutchison <ehutchison@apple.com>
[ iOS15 iPad Debug ] webrtc/video-mute.html is a flaky timeout.
https://bugs.webkit.org/show_bug.cgi?id=231640.
Unreviewed test gardening.
* platform/ios-14-wk2/TestExpectations:
* platform/ipad/TestExpectations:
2021-10-12 Eric Hutchison <ehutchison@apple.com>
[ iOS15 Debug ] webgl/pending/conformance/glsl/misc/shader-with-reserved-words-2.html is a flaky timeout.
https://bugs.webkit.org/show_bug.cgi?id=231638.
Unreviewed test gardening.
* platform/ios-wk2/TestExpectations:
2021-10-12 Gabriel Nava Marino <gnavamarino@apple.com>
ASSERT hit in surrogatePairAwareIndex and surrogatePairAwareStart lambdas for text with unpaired surrogates
https://bugs.webkit.org/show_bug.cgi?id=231606
Reviewed by Myles C. Maxfield.
* fast/text/word-break-column-gap-display-flex-utf16-surrogates-expected.txt: Added.
* fast/text/word-break-column-gap-display-flex-utf16-surrogates.html: Added.
* fast/text/word-break-letter-spacing-utf16-surrogates-expected.txt: Added.
* fast/text/word-break-letter-spacing-utf16-surrogates.html: Added.
* fast/text/word-break-max-width-utf16-surrogates-expected.txt: Added.
* fast/text/word-break-max-width-utf16-surrogates.html: Added.
2021-10-12 Eric Hutchison <ehutchison@apple.com>
Update expectations for webgl/1.0.3/conformance/uniforms/uniform-default-values.html.
https://bugs.webkit.org/show_bug.cgi?id=231514.
Unreviewed test gardening.
* platform/ios-simulator/TestExpectations:
2021-10-12 Eric Hutchison <ehutchison@apple.com>
[ iOS15 Debug ] media/media-fragments/TC0001.html is a flaky timeout.
https://bugs.webkit.org/show_bug.cgi?id=231636.
Unreviewed test gardening.
* platform/ios-wk2/TestExpectations:
2021-10-12 Ayumi Kojima <ayumi_kojima@apple.com>
[ iPad Release ] editing/selection/ios/scroll-to-reveal-selection-when-showing-software-keyboard.html is timing out.
https://bugs.webkit.org/show_bug.cgi?id=231635
Unreviewed test gardening.
* platform/ipad/TestExpectations:
2021-10-12 Eric Hutchison <ehutchison@apple.com>
[ iOS15 Debug ] fast/selectors/case-insensitive-attribute-bascis.html is failing).
https://bugs.webkit.org/show_bug.cgi?id=231631.
Unreviewed test gardening.
* platform/ios-wk2/TestExpectations:
2021-10-12 Ayumi Kojima <ayumi_kojima@apple.com>
[ iOS ] http/tests/cache/disk-cache/redirect-chain-limits.html is a flaky timeout.
https://bugs.webkit.org/show_bug.cgi?id=231630
Unreviewed test gardening.
* platform/ios-wk2/TestExpectations:
2021-10-12 Eric Hutchison <ehutchison@apple.com>
[ iOS15 Debug ] fast/scrolling/ios/click-events-during-momentum-scroll-in-main-frame.html is a flaky timeout.
https://bugs.webkit.org/show_bug.cgi?id=231623.
Unreviewed test gardening.
* platform/ios-wk2/TestExpectations:
2021-10-12 Eric Hutchison <ehutchison@apple.com>
[ iOS15 ] 2 iOS rotation tests are timing out constantly.
https://bugs.webkit.org/show_bug.cgi?id=231622.
Unreviewed test gardening.
* platform/ios-wk2/TestExpectations:
2021-10-12 Ayumi Kojima <ayumi_kojima@apple.com>
[ iOS & macOS wk2 ] imported/w3c/web-platform-tests/webrtc/RTCDataChannel-close.html is a flaky failure.
https://bugs.webkit.org/show_bug.cgi?id=230696
Unreviewed test gardening.
* platform/ios-wk2/TestExpectations:
2021-10-12 Eric Hutchison <ehutchison@apple.com>
[ iOS15 Debug ] 4 dom-paste tests are flaky timeouts.
https://bugs.webkit.org/show_bug.cgi?id=231619.
Unreviewed test gardening.
* platform/ios-wk2/TestExpectations:
2021-10-12 Ayumi Kojima <ayumi_kojima@apple.com>
[ iOS ] fast/mediastream/apply-constraints-video.html is a flaky failure.
https://bugs.webkit.org/show_bug.cgi?id=231618
Unreviewed test gardening.
* platform/ios-wk2/TestExpectations:
2021-10-12 Eric Hutchison <ehutchison@apple.com>
media/track/track-cue-css.html is a flaky image failure and timeout.
https://bugs.webkit.org/show_bug.cgi?id=230070.
Unreviewed test gardening.
* platform/ios-wk2/TestExpectations:
2021-10-12 Eric Hutchison <ehutchison@apple.com>
[ iOS15 iPad Debug ] compositing/layer-creation/scale-rotation-transition-overlap.html is a flaky timeout.
https://bugs.webkit.org/show_bug.cgi?id=231616.
Unreviewed test gardening.
* platform/ios-wk2/TestExpectations:
* platform/ipad/TestExpectations:
2021-10-12 Ayumi Kojima <ayumi_kojima@apple.com>
[ iOS ] imported/blink/fast/dom/importNode-cdata.html is a flaky timeout.
https://bugs.webkit.org/show_bug.cgi?id=231612
Unreviewed test gardening.
* platform/ios-wk2/TestExpectations:
2021-10-12 Eric Hutchison <ehutchison@apple.com>
[ iOS15 iPad Debug ] imported/w3c/web-platform-tests/webrtc-encoded-transform/sframe-transform-in-worker.https.html is a flaky failure.
https://bugs.webkit.org/show_bug.cgi?id=231611.
Unreviewed test gardening.
* platform/ipad/TestExpectations:
2021-10-12 Eric Hutchison <ehutchison@apple.com>
[ iOS15 iPad Debug ] imported/w3c/web-platform-tests/webmessaging/MessagePort_onmessage_start.any.worker.html is a flaky failure (reached unreachable code).
https://bugs.webkit.org/show_bug.cgi?id=231609.
Unreviewed test gardening.
* platform/ipad/TestExpectations:
2021-10-12 Ayumi Kojima <ayumi_kojima@apple.com>
[ iOS ] applicationmanifest/developer-warnings.html is a flaky timeout.
https://bugs.webkit.org/show_bug.cgi?id=231610
Unreviewed test gardening.
* platform/ios-wk2/TestExpectations:
2021-10-12 Ayumi Kojima <ayumi_kojima@apple.com>
[ iOS ] fast/scrolling/ios/reconcile-layer-position-recursive.html is a flaky failure.
https://bugs.webkit.org/show_bug.cgi?id=231603
Unreviewed test gardening.
* platform/ios-wk2/TestExpectations:
2021-10-12 Eric Hutchison <ehutchison@apple.com>
REGRESSION: (r283871) [ macOS wk2 Release ] 2 CSS tests are failing.
https://bugs.webkit.org/show_bug.cgi?id=231600.
Unreviewed test gardening.
* platform/mac-wk2/TestExpectations:
2021-10-12 Ayumi Kojima <ayumi_kojima@apple.com>
[ iOS ] imported/w3c/web-platform-tests/webrtc/simulcast/getStats.https.html is a flaky failure.
https://bugs.webkit.org/show_bug.cgi?id=231602
Unreviewed test gardening.
* platform/ios-wk2/TestExpectations:
2021-10-12 Ayumi Kojima <ayumi_kojima@apple.com>
[ iOS Release ] fast/mediastream/mediaElement-gc.html is a flaky failure.
https://bugs.webkit.org/show_bug.cgi?id=231601
Unreviewed test gardening.
* platform/ios-wk2/TestExpectations:
2021-10-12 Ayumi Kojima <ayumi_kojima@apple.com>
[ iOS ] http/tests/resourceLoadStatistics/switch-session-on-navigation-to-prevalent-without-interaction.py is a flaky failure.
https://bugs.webkit.org/show_bug.cgi?id=231586
Unreviewed test gardening.
* platform/ios-wk2/TestExpectations:
2021-10-12 Ayumi Kojima <ayumi_kojima@apple.com>
[ iOS 15 Debug ] imported/w3c/web-platform-tests/IndexedDB/interleaved-cursors-small.html is a flaky failure.
https://bugs.webkit.org/show_bug.cgi?id=231387
Unreviewed test gardening.
* platform/ios-wk2/TestExpectations:
2021-10-12 Ayumi Kojima <ayumi_kojima@apple.com>
media/track/track-cue-css.html is a flaky image failure.
https://bugs.webkit.org/show_bug.cgi?id=230070
Unreviewed test gardening.
* platform/ios-14-wk2/TestExpectations:
* platform/ios-wk2/TestExpectations:
2021-10-12 Ayumi Kojima <ayumi_kojima@apple.com>
[Release WK2] imported/w3c/web-platform-tests/file-system-access/sandboxed_FileSystemBaseHandle-postMessage-windows.https.window.html is a flaky failure.
https://bugs.webkit.org/show_bug.cgi?id=231348
Unreviewed test gardening.
* platform/wk2/TestExpectations:
2021-10-12 Kimmo Kinnunen <kkinnunen@apple.com>
WebGL first clear is lost when scissor is used for preserveDrawingBuffer:true in some conditions
https://bugs.webkit.org/show_bug.cgi?id=230618
<rdar://problem/83668270>
Reviewed by Dean Jackson.
Add a pixel test to verify that scissor is not applied when blitting drawing buffer
to display buffer in preserveDrawingBuffer: true case.
* webgl/gl-clear-preserve-drawing-buffer-bug-expected.html: Added.
* webgl/gl-clear-preserve-drawing-buffer-bug.html: Added.
2021-10-11 Arcady Goldmints-Orlov <agoldmints@igalia.com>
[GLIB] Update test expectations for failing CSS tests.
https://bugs.webkit.org/show_bug.cgi?id=231547
Unreviewed test gardening.
* platform/glib/TestExpectations:
* platform/gtk/TestExpectations:
2021-10-11 Chris Dumez <cdumez@apple.com>
[COOP] Crash under ReportingEndpointsCache::addEndpointFromDictionary()
https://bugs.webkit.org/show_bug.cgi?id=231537
<rdar://83530643>
Reviewed by Geoffrey Garen.
Add layout test coverage.
* http/wpt/cross-origin-opener-policy/report-to-multiple-endpoints-expected.txt: Added.
* http/wpt/cross-origin-opener-policy/report-to-multiple-endpoints.html: Added.
* http/wpt/cross-origin-opener-policy/report-to-multiple-endpoints.html.headers: Added.
2021-10-11 Ayumi Kojima <ayumi_kojima@apple.com>
[ iOS 15 ] imported/w3c/web-platform-tests/WebCryptoAPI/derive_bits_keys/pbkdf2.https.any.worker.html is flaky timing out.
https://bugs.webkit.org/show_bug.cgi?id=231544
Unreviewed test gardening.
* platform/ios-wk2/TestExpectations:
2021-10-11 Ayumi Kojima <ayumi_kojima@apple.com>
[ iOS macOS Debug ] webgl/1.0.3/conformance/glsl/bugs/long-expressions-should-not-crash.html is a flaky timeout.
https://bugs.webkit.org/show_bug.cgi?id=231541
Unreviewed test gardening.
* platform/ios-wk2/TestExpectations:
* platform/mac-wk1/TestExpectations:
2021-10-11 Tim Nguyen <ntim@apple.com>
Implement new autofocus behavior
https://bugs.webkit.org/show_bug.cgi?id=203139
<rdar://problem/56397019>
Reviewed by Wenson Hsieh.
Make WebKit match the new autofocus spec:
- https://html.spec.whatwg.org/multipage/interaction.html#the-autofocus-attribute
- https://html.spec.whatwg.org/multipage/interaction.html#focusing-steps
The new autofocus behavior queues up all autofocusable elements (visible or not), then
fires autofocus asynchronously during the "update rendering" steps, unlike the old behavior
which runs focus synchronously whenever it finds a visible autofocusable element.
Original patch by Ryosuke Niwa.
* TestExpectations:
* fast/dom/Window/window-scroll-ignore-null-frame.html:
* fast/dom/adopt-node-crash-2-expected.txt:
* fast/dom/adopt-node-crash-2.html:
* fast/dom/window-inner-width-crash.html:
* fast/forms/autofocus-in-sandbox-with-allow-scripts-expected.txt:
* fast/forms/autofocus-in-sandbox-with-allow-scripts.html:
* fast/forms/autofocus-keygen.html:
* fast/forms/autofocus-opera-001.html:
* fast/forms/autofocus-opera-002.html:
* fast/forms/autofocus-opera-003.html:
* fast/forms/autofocus-opera-006.html:
* fast/forms/autofocus-opera-007.html:
* fast/forms/change-input-type-in-focus-handler.html:
* fast/frames/crash-when-iframe-is-remove-in-eventhandler.html:
* fast/history/page-cache-execute-script-during-restore.html:
* platform/ios-wk2/TestExpectations:
* platform/ios-wk2/imported/w3c/web-platform-tests/html/interaction/focus/the-autofocus-attribute/update-the-rendering-expected.txt:
* platform/ios/imported/w3c/web-platform-tests/selection/selection-select-all-move-input-crash-expected.txt:
* platform/mac-wk1/imported/w3c/web-platform-tests/html/interaction/focus/the-autofocus-attribute/update-the-rendering-expected.txt:
* platform/win/TestExpectations:
2021-10-11 Ayumi Kojima <ayumi_kojima@apple.com>
[ iOS BigSur wk1 ] webgl/1.0.3/conformance/uniforms/uniform-default-values.html is flaky timing out.
https://bugs.webkit.org/show_bug.cgi?id=231514
Unreviewed test gardening.
* platform/ios-wk2/TestExpectations:
* platform/mac-wk1/TestExpectations:
2021-10-11 Ben Nham <nham@apple.com>
Add push registration stubs
https://bugs.webkit.org/show_bug.cgi?id=231064
Reviewed by Youenn Fablet.
Add basic tests for PushManager.subscribe in both the window and service worker contexts.
* http/wpt/push-api/pushManager-worker.js: Added.
* http/wpt/push-api/pushManager.any-expected.txt: Added.
* http/wpt/push-api/pushManager.any.html: Added.
* http/wpt/push-api/pushManager.any.js: Added.
(isServiceWorker.promise_test.async test):
(else.promise_test.async test):
(promise_test.async test):
* http/wpt/push-api/pushManager.any.serviceworker-expected.txt: Added.
* http/wpt/push-api/pushManager.any.serviceworker.html: Added.
2021-10-11 Antti Koivisto <antti@apple.com>
Remove inline box decoration painting quirk
https://bugs.webkit.org/show_bug.cgi?id=231510
Reviewed by Alan Bujtas.
* fast/backgrounds/quirks-mode-line-box-backgrounds-expected-mismatch.html: Added.
* fast/backgrounds/quirks-mode-line-box-backgrounds.html:
* platform/glib/fast/backgrounds/quirks-mode-line-box-backgrounds-expected.txt: Removed.
* platform/gtk/fast/backgrounds/quirks-mode-line-box-backgrounds-expected.png: Removed.
* platform/ios/fast/backgrounds/quirks-mode-line-box-backgrounds-expected.txt: Removed.
* platform/mac/fast/backgrounds/quirks-mode-line-box-backgrounds-expected.png: Removed.
* platform/mac/fast/backgrounds/quirks-mode-line-box-backgrounds-expected.txt: Removed.
* platform/win/fast/backgrounds/quirks-mode-line-box-backgrounds-expected.txt: Removed.
* platform/wincairo/fast/backgrounds/quirks-mode-line-box-backgrounds-expected.txt: Removed.
2021-10-11 Tim Nguyen <ntim@apple.com>
Import new top layer WPTs
https://bugs.webkit.org/show_bug.cgi?id=229318
Reviewed by Youenn Fablet.
Sync html/semantics/interactive-elements/the-dialog-element/ WPTs from https://github.com/web-platform-tests/wpt/commit/023d5aa5d338569ae12988190705e1d570930d61
* TestExpectations:
2021-10-10 Sihui Liu <sihui_liu@apple.com>
Add support for iterating FileSystemDirectoryHandle
https://bugs.webkit.org/show_bug.cgi?id=231142
<rdar://problem/83848092>
Reviewed by Youenn Fablet and Yusuke Suzuki.
* platform/wk2/TestExpectations: mark some tests as flaky failure on release builds. They were flaky at import,
but they didn't get to run due to missing directory iteration support.
* storage/filesystemaccess/directory-handle-iteration-expected.txt: Added.
* storage/filesystemaccess/directory-handle-iteration-worker-expected.txt: Added.
* storage/filesystemaccess/directory-handle-iteration-worker.html: Added.
* storage/filesystemaccess/directory-handle-iteration.html: Added.
* storage/filesystemaccess/resources/directory-handle-iteration.js: Added.
(testPrototype):
(async testNext):
(async test):
2021-10-10 Alan Bujtas <zalan@apple.com>
[LFC][IFC] Do no bail out on boundary neutral characters
https://bugs.webkit.org/show_bug.cgi?id=231485
Reviewed by Antti Koivisto.
* TestExpectations:
2021-10-09 Alan Bujtas <zalan@apple.com>
Ideographic space behaves as breaking space
https://bugs.webkit.org/show_bug.cgi?id=231480
Reviewed by Antti Koivisto.
* TestExpectations:
2021-10-09 Simon Fraser <simon.fraser@apple.com>
Run smooth scroll animations on the scrolling thread
https://bugs.webkit.org/show_bug.cgi?id=231481
Reviewed by Tim Horton.
imported/w3c/web-platform-tests/css/cssom-view/idlharness.html seems to pass just fine.
imported/w3c/web-platform-tests/css/cssom-view/scroll-behavior-smooth.html has some problems
indicated by the github issue.
Three tests pass now on iOS (but they are not yet scrolling in the UI process).
* TestExpectations:
* platform/ios/TestExpectations:
2021-10-09 Rob Buis <rbuis@igalia.com>
Remove scrollbars explicitly when destroying render tree
https://bugs.webkit.org/show_bug.cgi?id=229274
Reviewed by Simon Fraser.
* editing/inserting/insert-html-crash-02-expected.txt: Added.
* editing/inserting/insert-html-crash-02.html: Added.
2021-10-08 Devin Rousso <drousso@apple.com>
[GPU Process] support rendering Apple Pay logos
https://bugs.webkit.org/show_bug.cgi?id=230664
<rdar://problem/83187282>
Reviewed by Tim Horton.
* fast/css/webkit-named-image/apple-pay-logo-black/background-size-centered.html: Added.
* fast/css/webkit-named-image/apple-pay-logo-black/background-size-centered-expected-mismatch.html: Added.
* fast/css/webkit-named-image/apple-pay-logo-black/background-size.html: Added.
* fast/css/webkit-named-image/apple-pay-logo-black/background-size-expected-mismatch.html: Added.
* fast/css/webkit-named-image/apple-pay-logo-black/basic.html: Added.
* fast/css/webkit-named-image/apple-pay-logo-black/basic-expected-mismatch.html: Added.
* fast/css/webkit-named-image/apple-pay-logo-black/container-larger-height.html: Added.
* fast/css/webkit-named-image/apple-pay-logo-black/container-larger-height-expected-mismatch.html: Added.
* fast/css/webkit-named-image/apple-pay-logo-black/container-larger-width.html: Added.
* fast/css/webkit-named-image/apple-pay-logo-black/container-larger-width-expected-mismatch.html: Added.
* fast/css/webkit-named-image/apple-pay-logo-black/mask.html: Added.
* fast/css/webkit-named-image/apple-pay-logo-black/mask-expected-mismatch.html: Added.
* fast/css/webkit-named-image/apple-pay-logo-white/background-size-centered.html: Added.
* fast/css/webkit-named-image/apple-pay-logo-white/background-size-centered-expected-mismatch.html: Added.
* fast/css/webkit-named-image/apple-pay-logo-white/background-size.html: Added.
* fast/css/webkit-named-image/apple-pay-logo-white/background-size-expected-mismatch.html: Added.
* fast/css/webkit-named-image/apple-pay-logo-white/basic.html: Added.
* fast/css/webkit-named-image/apple-pay-logo-white/basic-expected-mismatch.html: Added.
* fast/css/webkit-named-image/apple-pay-logo-white/container-larger-height.html: Added.
* fast/css/webkit-named-image/apple-pay-logo-white/container-larger-height-expected-mismatch.html: Added.
* fast/css/webkit-named-image/apple-pay-logo-white/container-larger-width.html: Added.
* fast/css/webkit-named-image/apple-pay-logo-white/container-larger-width-expected-mismatch.html: Added.
* fast/css/webkit-named-image/apple-pay-logo-white/mask.html: Added.
* fast/css/webkit-named-image/apple-pay-logo-white/mask-expected-mismatch.html: Added.
* TestExpectations:
* platform/ios/TestExpectations:
* platform/mac/TestExpectations:
Skip the above tests everywhere except iOS and macOS.
2021-10-08 Simon Fraser <simon.fraser@apple.com>
Unreviewed. Fix up some TestExpectations errors.
* platform/ios/TestExpectations:
* platform/mac/TestExpectations:
2021-10-08 Aditya Keerthi <akeerthi@apple.com>
Add support for '-webkit-appearance: auto'
https://bugs.webkit.org/show_bug.cgi?id=231203
rdar://83696133
Reviewed by Wenson Hsieh.
* platform/gtk/imported/w3c/web-platform-tests/css/css-ui/appearance-cssom-001-expected.txt:
* platform/ios-wk2/imported/w3c/web-platform-tests/css/css-ui/appearance-cssom-001-expected.txt:
* platform/wpe/imported/w3c/web-platform-tests/css/css-ui/appearance-cssom-001-expected.txt:
2021-10-08 Ayumi Kojima <ayumi_kojima@apple.com>
[ iOS 15 Debug ] ASSERTION FAILED: sockets.empty().
https://bugs.webkit.org/show_bug.cgi?id=231451
Unreviewed test gardening.
* platform/ios-wk2/TestExpectations:
2021-10-08 Alan Bujtas <zalan@apple.com>
ASSERTION FAILED: m_collapsibleLogicalWidth <= m_logicalWidth in WebCore::Layout::InlineContentBreaker::ContinuousContent::append
https://bugs.webkit.org/show_bug.cgi?id=231274
Reviewed by Antti Koivisto.
* fast/inline/negative-margin-with-collapsible-content-assert-expected.txt: Added.
* fast/inline/negative-margin-with-collapsible-content-assert.html: Added.
2021-10-08 Eric Hutchison <ehutchison@apple.com>
[ iOS15 ] imported/blink/fast/dom/shadow/shadowdom-for-keygen-only-shadow.html is a flaky crash.
https://bugs.webkit.org/show_bug.cgi?id=231444.
Unreviewed test gardening.
* platform/ios-wk2/TestExpectations:
2021-10-08 Ayumi Kojima <ayumi_kojima@apple.com>
[ iOS Release & macOS wk2 ] http/wpt/mediarecorder/set-srcObject-MediaStream-Blob.html is a flaky failure.
https://bugs.webkit.org/show_bug.cgi?id=231442
Unreviewed test gardening.
* platform/ios-wk2/TestExpectations:
2021-10-08 Andres Gonzalez <andresg_22@apple.com>
AX: AXMathRootRadicand should return an array of elements, not just the first
https://bugs.webkit.org/show_bug.cgi?id=230986
<rdar://83688829>
Reviewed by Chris Fleizach.
Instead of getting the root radicand as the first child of the root
element, use the readonly property mathRootRadicand.
Added a check for the length of the mathRootRadicand array.
* accessibility/mac/mathml-elements-expected.txt:
* accessibility/mac/mathml-elements.html:
* accessibility/mac/mathml-root-expected.txt:
* accessibility/mac/mathml-root.html:
Added the test case where the square root element has a radicand
consisting of more than one AX object.
* platform/mac-wk1/TestExpectations:
2021-10-08 Ayumi Kojima <ayumi_kojima@apple.com>
[ iOS 15 ] Rebaselining platform/ios/ios/fast/text/opticalFontWithWeight.html.
https://bugs.webkit.org/show_bug.cgi?id=231380
Unreviewed test gardening.
* platform/ios/platform/ios/ios/fast/text/opticalFontWithWeight-expected.txt:
2021-10-08 Youenn Fablet <youenn@apple.com>
Move deviceChange handling from CoreAudioSharedUnit to BaseAudioSharedUnit
https://bugs.webkit.org/show_bug.cgi?id=231284
Reviewed by Eric Carlson.
* fast/mediastream/microphone-change-while-capturing-expected.txt: Added.
* fast/mediastream/microphone-change-while-capturing.html: Added.
2021-10-08 Ayumi Kojima <ayumi_kojima@apple.com>
[ iOS14 EWS ] http/tests/privateClickMeasurement/attribution-conversion-through-fetch-keepalive.html is a flaky crash.
https://bugs.webkit.org/show_bug.cgi?id=231431
Unreviewed test gardening.
* platform/ios-wk2/TestExpectations:
2021-10-08 Antti Koivisto <antti@apple.com>
REGRESSION (r277818): XHR with requestType document broken for larger HTML files
https://bugs.webkit.org/show_bug.cgi?id=231138
<rdar://problem/83823282>
Reviewed by Darin Adler.
* http/tests/xmlhttprequest/resources/large-html-with-script-tags.py: Added.
* http/tests/xmlhttprequest/xhr-and-parse-large-document-expected.txt: Added.
* http/tests/xmlhttprequest/xhr-and-parse-large-document.html: Added.
* http/tests/xmlhttprequest/xhr-large-document-expected.txt: Added.
* http/tests/xmlhttprequest/xhr-large-document.html: Added.
2021-10-08 Sergio Villar Senin <svillar@igalia.com>
[GTK] web-platform-tests/css/css-flexbox/text-as-flexitem-size-001.html is failing
https://bugs.webkit.org/show_bug.cgi?id=231429
Unreviewed gardening. Adding GTK expectations for a test that has been failing since it was imported.
* platform/gtk/imported/w3c/web-platform-tests/css/css-flexbox/text-as-flexitem-size-001-expected.txt: Added.
2021-10-08 Tyler Wilcock <tyler_w@apple.com>
AX: Expose the URL attribute of <video> elements
https://bugs.webkit.org/show_bug.cgi?id=231384
Reviewed by Chris Fleizach.
Add test ensuring <video> accessibility elements return
a URL attribute when appropriate.
* accessibility/resources/test.mp4: Added.
* accessibility/video-element-url-attribute-expected.txt: Added.
* accessibility/video-element-url-attribute.html: Added.
* platform/ios/TestExpectations: Enable new test.
* platform/win/TestExpectations: Skip new test due to lack of mp4
support.
2021-10-08 Tim Nguyen <ntim@apple.com>
Re-sync the-dialog-element and inert WPT from upstream
https://bugs.webkit.org/show_bug.cgi?id=231392
Reviewed by Youenn Fablet.
Upstream commit: https://github.com/web-platform-tests/wpt/commit/a44515b7c7774abf1256f488bf0e9dc02459fced
* TestExpectations:
* platform/gtk/imported/w3c/web-platform-tests/inert/inert-retargeting-iframe.tentative-expected.txt: Removed.
* platform/wpe/imported/w3c/web-platform-tests/inert/inert-retargeting-iframe.tentative-expected.txt: Removed.
2021-10-07 Alan Bujtas <zalan@apple.com>
Do not check for firstLineStyle while constructing RenderText
https://bugs.webkit.org/show_bug.cgi?id=231370
<rdar://83973189>
Reviewed by Antti Koivisto.
* TestExpectations: existing bug surfaced by this change.
* fast/inline/first-line-style-too-early-crash-expected.txt: Added.
* fast/inline/first-line-style-too-early-crash.html: Added.
2021-10-07 Ayumi Kojima <ayumi_kojima@apple.com>
[ iOS ] Marking expectations as slow for the tests that are flaky timing out.
https://bugs.webkit.org/show_bug.cgi?id=231397
Unreviewed test gardening.
* platform/ios-wk2/TestExpectations:
2021-10-07 Ayumi Kojima <ayumi_kojima@apple.com>
[ iOS 15 Debug ] fast/selectors/is-complex.html is timing out.
https://bugs.webkit.org/show_bug.cgi?id=231391
Unreviewed test gardening.
* platform/ios-wk2/TestExpectations:
2021-10-07 Aditya Keerthi <akeerthi@apple.com>
[css-ui] Parsing support for accent-color
https://bugs.webkit.org/show_bug.cgi?id=231334
rdar://83955508
Reviewed by Antti Koivisto.
Platform-specific rebaselines.
* platform/gtk/imported/w3c/web-platform-tests/css/cssom/cssstyledeclaration-csstext-expected.txt:
* platform/gtk/imported/w3c/web-platform-tests/css/cssom/getComputedStyle-detached-subtree-expected.txt:
* platform/ios-wk2/imported/w3c/web-platform-tests/css/cssom/cssstyledeclaration-csstext-expected.txt:
* platform/ios-wk2/imported/w3c/web-platform-tests/css/cssom/getComputedStyle-detached-subtree-expected.txt:
* platform/ios/imported/w3c/web-platform-tests/css/cssom/cssstyledeclaration-csstext-expected.txt:
* platform/wpe/imported/w3c/web-platform-tests/css/cssom/cssstyledeclaration-csstext-expected.txt:
* platform/wpe/imported/w3c/web-platform-tests/css/cssom/getComputedStyle-detached-subtree-expected.txt:
2021-10-07 Ayumi Kojima <ayumi_kojima@apple.com>
Cleaning up expectations for iOS 15.
https://bugs.webkit.org/show_bug.cgi?id=230968
Unreviewed test gardening.
* platform/ios/TestExpectations:
2021-10-07 Ayumi Kojima <ayumi_kojima@apple.com>
[ iOS 15 Debug ] imported/w3c/web-platform-tests/IndexedDB/interleaved-cursors-small.html is a flaky failure.
https://bugs.webkit.org/show_bug.cgi?id=231387
Unreviewed test gardening.
* platform/ios-wk2/TestExpectations:
2021-10-07 Eric Hutchison <ehutchison@apple.com>
[ BigSur wk2 ] http/tests/resourceLoadStatistics/website-data-removal-for-site-with-user-interaction.html is a flaky timeout.
https://bugs.webkit.org/show_bug.cgi?id=231386.
Unreviewed test gardening.
* platform/mac-wk2/TestExpectations:
2021-10-07 Truitt Savell <tsavell@apple.com>
Remove expectation for accessibility/misspelling-range.html from ios-simulator
https://bugs.webkit.org/show_bug.cgi?id=231261
Unreviewed test gardening.
* platform/ios-simulator/TestExpectations:
2021-10-07 Arcady Goldmints-Orlov <agoldmints@igalia.com>
[GTK][WPE] Disable privateClickMeasurement when creating the network process
https://bugs.webkit.org/show_bug.cgi?id=231175
Reviewed by Adrian Perez de Castro.
Skip privateClickMeasurement tests on GTK and WPE.
* platform/glib/TestExpectations:
* platform/glib/http/tests/privateClickMeasurement/attribution-conversion-through-cross-site-image-redirect-expected.txt: Removed.
* platform/glib/http/tests/privateClickMeasurement/attribution-conversion-through-fetch-keepalive-expected.txt: Removed.
* platform/glib/http/tests/privateClickMeasurement/attribution-conversion-through-image-redirect-ephemeral-expected.txt: Removed.
* platform/glib/http/tests/privateClickMeasurement/attribution-conversion-through-image-redirect-in-new-window-expected.txt: Removed.
* platform/glib/http/tests/privateClickMeasurement/attribution-conversion-through-image-redirect-with-priority-expected.txt: Removed.
* platform/glib/http/tests/privateClickMeasurement/attribution-conversion-through-image-redirect-without-priority-expected.txt: Removed.
* platform/glib/http/tests/privateClickMeasurement/conversion-disabled-in-ephemeral-session-expected.txt: Removed.
* platform/glib/http/tests/privateClickMeasurement/private-click-measurement-with-source-nonce-null-content-expected.txt: Removed.
* platform/glib/http/tests/privateClickMeasurement/private-click-measurement-with-source-nonce-wrong-content-type-expected.txt: Removed.
* platform/glib/http/tests/privateClickMeasurement/second-attribution-converted-with-higher-priority-expected.txt: Removed.
* platform/glib/http/tests/privateClickMeasurement/second-attribution-converted-with-lower-priority-expected.txt: Removed.
* platform/glib/http/tests/privateClickMeasurement/second-conversion-with-higher-priority-expected.txt: Removed.
* platform/glib/http/tests/privateClickMeasurement/second-conversion-with-lower-priority-expected.txt: Removed.
* platform/glib/http/tests/privateClickMeasurement/store-private-click-measurement-expected.txt: Removed.
* platform/wpe/TestExpectations:
2021-10-07 Ayumi Kojima <ayumi_kojima@apple.com>
security/contentSecurityPolicy/video-with-blob-url-allowed-by-media-src-star.html and security/contentSecurityPolicy/video-with-data-url-allowed-by-media-src-star.html are flaky.
https://bugs.webkit.org/show_bug.cgi?id=155196
Unreviewed test gardening.
* platform/ios-wk2/TestExpectations:
2021-10-07 Ayumi Kojima <ayumi_kojima@apple.com>
[ iOS 15 ] Rebaselining platform/ios/ios/fast/text/opticalFontWithWeight.html.
https://bugs.webkit.org/show_bug.cgi?id=231380
Unreviewed test gardening.
* platform/ios/ios/fast/text/opticalFontWithWeight-expected.txt:
2021-10-07 Eric Hutchison <ehutchison@apple.com>
[ BigSur wk2 Release ] http/tests/resourceLoadStatistics/sandboxed-nesting-iframe-with-non-sandboxed-iframe-redirect-ip-to-localhost-to-ip.html is a flaky failure.
https://bugs.webkit.org/show_bug.cgi?id=231379.
Unreviewed test gardening.
* platform/mac-wk2/TestExpectations:
2021-10-07 Ayumi Kojima <ayumi_kojima@apple.com>
[ iOS 15 ] platform/ios/fast/text/system-monospaced-numbers.html is failing.
https://bugs.webkit.org/show_bug.cgi?id=231378
Unreviewed test gardening.
* platform/ios-wk2/TestExpectations:
2021-10-07 Ayumi Kojima <ayumi_kojima@apple.com>
[ iOS ] CSS Flexbox tests are constant failure (fixed-table-layout-with-percentage-width-in-flex-item.html and flex-item-compressible-001.html).
https://bugs.webkit.org/show_bug.cgi?id=230773
Unreviewed test gardening.
* platform/ios-wk2/TestExpectations:
2021-10-07 Nikita Vasilyev <nvasilyev@apple.com>
Web Inspector: Styles: format style declarations after editing
https://bugs.webkit.org/show_bug.cgi?id=178835
<rdar://problem/35185060>
Reviewed by Devin Rousso.
- Indent text of expected CSS properties.
- Test generateFormattedText with all permutations of its options.
- Add a basic test ensuring styleSheetTextRange updates correctly from the backend.
* inspector/css/add-css-property.html:
* inspector/css/generateCSSRuleString-expected.txt: Removed.
* inspector/css/generateCSSRuleString.html: Removed.
* inspector/css/generateFormattedText-expected.txt: Added.
* inspector/css/generateFormattedText.html: Added.
* inspector/css/modify-css-property-expected.txt:
* inspector/css/modify-css-property.html:
* inspector/css/modify-inline-style-expected.txt:
* inspector/css/resources/modify-css-property.css: Added.
(.rule-a):
(.rule-b):
(.rule-c):
(.rule-d):
2021-10-07 Ayumi Kojima <ayumi_kojima@apple.com>
[ BigSur AS EWS ] http/tests/xmlhttprequest/access-control-response-with-body.html is flaky crashing.
https://bugs.webkit.org/show_bug.cgi?id=231372
Unreviewed test gardening.
* platform/mac-wk2/TestExpectations:
2021-10-07 Antti Koivisto <antti@apple.com>
REGRESSION (IFC selections): Overlapping selection rectangles when selecting preformatted text
https://bugs.webkit.org/show_bug.cgi?id=231291
<rdar://problem/83939949>
Reviewed by Alan Bujtas.
* editing/selection/soft-line-break-no-paint-expected.html: Added.
* editing/selection/soft-line-break-no-paint.html: Added.
2021-10-07 Tim Nguyen <ntim@apple.com>
Stop relying on autofocus for deleteFromDocument-crash.html
https://bugs.webkit.org/show_bug.cgi?id=231357
Reviewed by Antti Koivisto.
Stop relying on current autofocus sync timing which will become async.
* imported/blink/editing/selection/deleteFromDocument-crash-expected.html:
* imported/blink/editing/selection/deleteFromDocument-crash.html:
2021-10-07 Rob Buis <rbuis@igalia.com>
Resync the-img-element WPT tests from upstream
https://bugs.webkit.org/show_bug.cgi?id=231297
Reviewed by Youenn Fablet.
No lazy image loading available on wk1.
* platform/mac-wk1/TestExpectations:
2021-10-06 Ben Nham <nham@apple.com>
Add PushSubscription stubs
https://bugs.webkit.org/show_bug.cgi?id=231278
Reviewed Alex Christensen.
Added a basic test for PushSubscription. Right now the test only runs in the window global
scope because it relies on a constructor called via window.internals. I'll add more test
cases and test it in the worker scope as well once we change the test to create a
subscription via a mocked PushManager.subscribe call instead.
* http/wpt/push-api/pushSubscription.https.any-expected.txt: Added.
* http/wpt/push-api/pushSubscription.https.any.html: Added.
* http/wpt/push-api/pushSubscription.https.any.js: Added.
(bytesFrom):
(test):
2021-10-06 Ayumi Kojima <ayumi_kojima@apple.com>
[ iOS 15 Debug ] imported/w3c/web-platform-tests/xhr/send-timeout-events.htm is a flaky failure.
https://bugs.webkit.org/show_bug.cgi?id=231337
Unreviewed test gardening.
* platform/ios-wk2/TestExpectations:
2021-10-06 Sihui Liu <sihui_liu@apple.com>
Add support for FileSystemSyncAccessHandle
https://bugs.webkit.org/show_bug.cgi?id=231185
<rdar://problem/83847859>
Reviewed by Youenn Fablet.
* storage/filesystemaccess/resources/sync-access-handle-basics.js: Added.
(finishTest):
(getDirectory):
* storage/filesystemaccess/sync-access-handle-basics-worker-expected.txt: Added.
* storage/filesystemaccess/sync-access-handle-basics-worker.html: Added.
2021-10-06 Wenson Hsieh <wenson_hsieh@apple.com>
Make ImageBuffer::drawingContext() return GraphicsContext instead of DisplayList::DrawingContext
https://bugs.webkit.org/show_bug.cgi?id=231296
Reviewed by Simon Fraser.
Remove support for display list tracking in the canvas element. See WebCore ChangeLog for more details.
* displaylists/canvas-display-list-expected.txt: Removed.
* displaylists/canvas-display-list.html: Removed.
* platform/ios/TestExpectations:
* platform/mac-wk1/TestExpectations:
2021-10-06 Ayumi Kojima <ayumi_kojima@apple.com>
[ iOS 15 ] media/track/track-forced-subtitles-in-band.html is failing.
https://bugs.webkit.org/show_bug.cgi?id=231333
Unreviewed test gardening.
* platform/ios-wk2/TestExpectations:
2021-10-06 Ryan Haddad <ryanhaddad@apple.com>
[ iOS 15 ]2 fast/dom/HTMLAnchorElement tests are failing
https://bugs.webkit.org/show_bug.cgi?id=231293
Unreviewed test gardening.
Add iOS 14 baselines.
* platform/ios-14/fast/dom/HTMLAnchorElement/anchor-file-blob-convert-to-download-async-delegate-expected.txt: Added.
* platform/ios-14/fast/dom/HTMLAnchorElement/anchor-file-blob-convert-to-download-expected.txt: Added.
2021-10-06 Kyle Piddington <kpiddington@apple.com>
Shadertoy "truchet district" fails to compile with error: Internal error compiling shader with Metal backend"
https://bugs.webkit.org/show_bug.cgi?id=229378
<rdar://problem/82299053>
Reviewed by Kenneth Russell.
Add a test testing Metal reserved words and standard library macros.
* webgl/pending/conformance/glsl/misc/shader-with-reserved-words-2-expected.txt: Added.
* webgl/pending/conformance/glsl/misc/shader-with-reserved-words-2.html: Added.
* webgl/pending/resources/webgl_test_files/conformance/glsl/misc/shader-with-reserved-words-2.html: Added.
2021-10-06 Ayumi Kojima <ayumi_kojima@apple.com>
[ iOS 15 ] http/tests/websocket/tests/hybi/close-code-and-reason.html is failing.
https://bugs.webkit.org/show_bug.cgi?id=231329
Unreviewed test gardening.
* platform/ios-wk2/TestExpectations:
2021-10-06 Tim Nguyen <ntim@apple.com>
Replace setTimeout(x, 0) with requestAnimationFrame(x) in some autofocus tests
https://bugs.webkit.org/show_bug.cgi?id=231323
Reviewed by Chris Dumez.
Reason being the new autofocus behavior will happen asynchronously during "update rendering"
steps which is caught by the first, but not the second method.
Other minor changes:
- Remove "in XHTML", because the file extensions aren't actually XHTML...
- Remove not needed attributes from <script> tag
- Remove unneeded whitespace
* fast/forms/autofocus-opera-001.html:
* fast/forms/autofocus-opera-002.html:
* fast/forms/autofocus-opera-003.html:
* fast/forms/autofocus-opera-004.html:
* fast/forms/autofocus-opera-005.html:
* fast/forms/autofocus-opera-006.html:
* fast/forms/autofocus-opera-007.html:
* fast/forms/autofocus-opera-008.html:
* fast/forms/textarea/textarea-autofocus-removal-while-focusing.html:
2021-10-06 Tim Nguyen <ntim@apple.com>
Rewrite plugins/object-onfocus-mutation-crash.html to stop relying on autofocus
https://bugs.webkit.org/show_bug.cgi?id=231327
Reviewed by Chris Dumez.
This test mostly tests onfocus and <object>, we don't need it to use autofocus.
The new autofocus timing will be async so we don't want this test to break with the new
behavior implemented. Use input.focus() instead.
* plugins/object-onfocus-mutation-crash.html:
2021-10-06 Ayumi Kojima <ayumi_kojima@apple.com>
[ iOS macOS wk2 ] http/tests/preload/onload_event.html is flaky failing.
https://bugs.webkit.org/show_bug.cgi?id=231328
Unreviewed test gardening.
* platform/ios-wk2/TestExpectations:
* platform/mac-wk2/TestExpectations:
2021-10-06 Chris Dumez <cdumez@apple.com>
[ iOS 15 ]2 fast/dom/HTMLAnchorElement tests are failing
https://bugs.webkit.org/show_bug.cgi?id=231293
<rdar://problem/83935262>
Unreviewed, land iOS15 baselines for those tests.
* platform/ios-wk2/TestExpectations:
* platform/ios/fast/dom/HTMLAnchorElement/anchor-file-blob-convert-to-download-async-delegate-expected.txt: Added.
* platform/ios/fast/dom/HTMLAnchorElement/anchor-file-blob-convert-to-download-expected.txt: Added.
2021-10-06 Kiet Ho <tho22@apple.com>
Import css/motion tests from WPT
https://bugs.webkit.org/show_bug.cgi?id=231195
Reviewed by Myles C. Maxfield.
* TestExpectations: Added ImageOnlyFailure expectations for css/motion reftests.
2021-10-06 Ayumi Kojima <ayumi_kojima@apple.com>
[ iOS 15 ] fast/text/accessibility-bold-system-font-2.html is image failing.
https://bugs.webkit.org/show_bug.cgi?id=231316
Unreviewed test gardening.
* platform/ios-wk2/TestExpectations:
2021-10-06 Ayumi Kojima <ayumi_kojima@apple.com>
[ iOS ] fast/events/ios/rotation/safe-area-insets-during-safari-type-rotation.html is timing out/ flaky failing.
https://bugs.webkit.org/show_bug.cgi?id=231315
Unreviewed test gardening.
* platform/ios-wk2/TestExpectations:
2021-10-06 Aditya Keerthi <akeerthi@apple.com>
Fix serialization of CSSMediaRule
https://bugs.webkit.org/show_bug.cgi?id=231249
Reviewed by Chris Dumez.
Rebaseline tests to account for the correct serialization.
* css3/supports-cssom-expected.txt:
* css3/supports-cssom.html:
* fast/css/resources/insertRule-media.js:
2021-10-06 Ayumi Kojima <ayumi_kojima@apple.com>
[ iOS ] fast/events/ios/fast-click-double-tap-to-zoom-in-on-text-and-then-again-to-zoom-out.html is a flaky failure.
https://bugs.webkit.org/show_bug.cgi?id=231311
Unreviewed test gardening.
* platform/ios-wk2/TestExpectations:
2021-10-06 Tim Nguyen <ntim@apple.com>
Reset m_isModal flag when removing <dialog> from document
https://bugs.webkit.org/show_bug.cgi?id=231290
Reviewed by Alan Bujtas.
m_isModal triggers the :-internal-modal-dialog pseudo class, which changes position from absolute to fixed.
When removing a modal <dialog> from the document, it is also removed from the top layer, so it makes sense
to reset the m_isModal flag as well as a result.
Updated test expectations to reflect new passing tests.
* TestExpectations:
* platform/ios-wk2/imported/w3c/web-platform-tests/html/semantics/interactive-elements/the-dialog-element/abspos-dialog-layout-expected.txt: Removed.
2021-10-06 Ayumi Kojima <ayumi_kojima@apple.com>
media/modern-media-controls tests are timing out.
https://bugs.webkit.org/show_bug.cgi?id=231187
Unreviewed test gardening.
* platform/ios-wk2/TestExpectations:
2021-10-06 Ayumi Kojima <ayumi_kojima@apple.com>
[ iOS 15 Debug ] 3 imported/w3c/web-platform-tests/selection tests are a flaky timeout.
https://bugs.webkit.org/show_bug.cgi?id=231299
Unreviewed test gardening.
* platform/ios-wk2/TestExpectations:
2021-10-06 Chris Lord <clord@igalia.com>
[GTK][WPE] CSS scroll snapping interacts badly with smooth scrolling
https://bugs.webkit.org/show_bug.cgi?id=229037
Reviewed by Simon Fraser.
Add a GTK-only test to verify CSS scroll snapping and kinetic/touchpad
scrolling behave correctly.
* TestExpectations:
* fast/scrolling/gtk/user-scroll-snapping-interaction-expected.txt: Added.
* fast/scrolling/gtk/user-scroll-snapping-interaction.html: Added.
* platform/gtk/TestExpectations:
2021-10-06 Ayumi Kojima <ayumi_kojima@apple.com>
[ iOS 15 ] 2 http/tests/app-privacy-report tests are timing out.
https://bugs.webkit.org/show_bug.cgi?id=231295
Unreviewed test gardening.
* platform/ios-wk2/TestExpectations:
2021-10-06 Ayumi Kojima <ayumi_kojima@apple.com>
[ iOS 15 ]2 fast/dom/HTMLAnchorElement tests are failing.
https://bugs.webkit.org/show_bug.cgi?id=231293
Unreviewed test gardening.
* platform/ios-wk2/TestExpectations:
2021-10-06 Ayumi Kojima <ayumi_kojima@apple.com>
[ iOS 15 ] fast/events/ios/rotation/safari-like-rotation.html is failing.
https://bugs.webkit.org/show_bug.cgi?id=231269
Unreviewed test gardening.
* platform/ios-wk2/TestExpectations:
2021-10-06 Alan Bujtas <zalan@apple.com>
[LFC][IFC] word-break: break-all only allows mid-word arbitrary breaking positions
https://bugs.webkit.org/show_bug.cgi?id=231247
Reviewed by Antti Koivisto.
* TestExpectations:
2021-10-06 Alicia Boya García <aboya@igalia.com>
[MSE][GStreamer] Honor MP4 edit lists
https://bugs.webkit.org/show_bug.cgi?id=231019
Reviewed by Xabier Rodriguez-Calvar.
Update expectations for mediasource-remove.html in the GStreamer
ports, as a couple subtests get fixed.
* platform/glib/imported/w3c/web-platform-tests/media-source/mediasource-remove-expected.txt:
2021-10-05 John Wilander <wilander@apple.com>
PCM: Allow measurement of links in nested, cross-site iframes
https://bugs.webkit.org/show_bug.cgi?id=229204
<rdar://problem/82310386>
Reviewed by Alex Christensen.
Developers have said it would be great to allow measurement of links served in
nested, cross-site iframes on the click source. The click still count as if it
happened on the first party click source site, and any attribution report still
goes to that first party. This change enables the *serving* of measurable links
in nested, cross-site iframes.
The standards issue where this was discussed:
https://github.com/privacycg/private-click-measurement/issues/7
* http/tests/privateClickMeasurement/resources/nestedTargetLink.html: Added.
* http/tests/privateClickMeasurement/store-private-click-measurement-nested-expected.txt: Added.
* http/tests/privateClickMeasurement/store-private-click-measurement-nested.html: Added.
2021-10-05 Fujii Hironori <Hironori.Fujii@sony.com>
[WinCairo] Unreviewed test gardening after r283550
* platform/wincairo/editing/deleting/delete-at-paragraph-boundaries-002-expected.txt:
* platform/wincairo/editing/deleting/delete-at-paragraph-boundaries-003-expected.txt:
* platform/wincairo/editing/deleting/delete-at-paragraph-boundaries-004-expected.txt:
* platform/wincairo/editing/deleting/delete-at-paragraph-boundaries-005-expected.txt:
* platform/wincairo/editing/deleting/delete-at-paragraph-boundaries-006-expected.txt:
* platform/wincairo/editing/deleting/delete-at-paragraph-boundaries-007-expected.txt:
* platform/wincairo/editing/deleting/delete-at-paragraph-boundaries-008-expected.txt:
* platform/wincairo/editing/deleting/delete-at-paragraph-boundaries-009-expected.txt:
* platform/wincairo/editing/deleting/delete-at-paragraph-boundaries-010-expected.txt:
* platform/wincairo/editing/deleting/delete-at-paragraph-boundaries-011-expected.txt:
* platform/wincairo/editing/deleting/non-smart-delete-expected.txt:
* platform/wincairo/editing/input/emacs-ctrl-o-expected.txt:
* platform/wincairo/editing/inserting/insert-br-quoted-001-expected.txt:
* platform/wincairo/editing/inserting/insert-br-quoted-002-expected.txt:
* platform/wincairo/editing/inserting/insert-br-quoted-003-expected.txt:
* platform/wincairo/editing/inserting/insert-br-quoted-004-expected.txt:
* platform/wincairo/editing/inserting/insert-br-quoted-005-expected.txt:
* platform/wincairo/editing/inserting/insert-br-quoted-006-expected.txt:
* platform/wincairo/editing/inserting/insert-div-026-expected.txt:
* platform/wincairo/editing/inserting/return-key-with-selection-001-expected.txt:
* platform/wincairo/editing/inserting/return-key-with-selection-002-expected.txt:
* platform/wincairo/editing/inserting/return-key-with-selection-003-expected.txt:
* platform/wincairo/editing/style/block-styles-007-expected.txt:
* platform/wincairo/editing/style/smoosh-styles-001-expected.txt:
* platform/wincairo/editing/style/smoosh-styles-003-expected.txt:
* platform/wincairo/editing/style/style-3998892-fix-expected.txt:
* platform/wincairo/editing/style/style-boundary-001-expected.txt:
* platform/wincairo/editing/style/style-boundary-002-expected.txt:
* platform/wincairo/editing/style/style-boundary-003-expected.txt:
* platform/wincairo/editing/style/style-boundary-004-expected.txt:
* platform/wincairo/editing/style/style-boundary-005-expected.txt:
* platform/wincairo/editing/unsupported-content/list-delete-001-expected.txt:
* platform/wincairo/editing/unsupported-content/list-delete-003-expected.txt:
* platform/wincairo/editing/unsupported-content/list-type-after-expected.txt:
* platform/wincairo/editing/unsupported-content/list-type-before-expected.txt:
* platform/wincairo/editing/unsupported-content/table-delete-002-expected.txt:
* platform/wincairo/editing/unsupported-content/table-type-after-expected.txt:
* platform/wincairo/editing/unsupported-content/table-type-before-expected.txt:
* platform/wincairo/fast/css/first-line-text-decoration-expected.txt:
* platform/wincairo/fast/css/first-line-text-decoration-inherited-from-parent-expected.txt:
* platform/wincairo/fast/text/firstline/001-expected.txt:
2021-10-05 Chris Dumez <cdumez@apple.com>
ASSERT(m_callback->hasCallback()) under IntersectionObserver::notify()
https://bugs.webkit.org/show_bug.cgi?id=231235
<rdar://80837616>
Reviewed by Ryosuke Niwa.
Add layout test coverage both for the crash and the Web facing behavior.
* intersection-observer/observe-disconnected-target-crash-expected.txt: Added.
* intersection-observer/observe-disconnected-target-crash.html: Added.
* intersection-observer/observe-disconnected-target-expected.txt: Added.
* intersection-observer/observe-disconnected-target.html: Added.
2021-10-05 Ayumi Kojima <ayumi_kojima@apple.com>
[ iOS Release ] fast/events/ios/rotation/layout-viewport-during-safari-type-rotation.html is flaky failing.
https://bugs.webkit.org/show_bug.cgi?id=231266
Unreviewed test gardening.
* platform/ios-wk2/TestExpectations:
2021-10-05 Jean-Yves Avenard <jya@apple.com>
createImageBitmap using a HLS video as source always return a black image.
https://bugs.webkit.org/show_bug.cgi?id=231225
rdar://83884031
Reviewed by Eric Carlson.
* http/tests/media/video-hls-copy-into-canvas-expected.txt: Added.
* http/tests/media/video-hls-copy-into-canvas.html: Added.
2021-10-05 Ayumi Kojima <ayumi_kojima@apple.com>
[ iOS 15 ] fast/events/ios/rotation/layout-viewport-during-rotation.html is failing.
https://bugs.webkit.org/show_bug.cgi?id=231264
Unreviewed test gardening.
* platform/ios-wk2/TestExpectations:
2021-10-05 Ayumi Kojima <ayumi_kojima@apple.com>
[ iOS ] fast/events/ios/rotation/resize-iframe-after-orientation-change.html is crashing/ failing.
https://bugs.webkit.org/show_bug.cgi?id=231262
Unreviewed test gardening.
* platform/ios-wk2/TestExpectations:
2021-10-05 Truitt Savell <tsavell@apple.com>
[ iOS ] accessibility/misspelling-range.html is constantly failing
https://bugs.webkit.org/show_bug.cgi?id=231261
Unreviewed test gardening.
* platform/ios/TestExpectations:
2021-10-05 Ayumi Kojima <ayumi_kojima@apple.com>
[ iOS 15 ] ASSERTION FAILED: isRunningTest(WebCore::applicationBundleIdentifier()).
https://bugs.webkit.org/show_bug.cgi?id=231255
Unreviewed test gardening.
* platform/ios-wk2/TestExpectations:
2021-10-05 Gabriel Nava Marino <gnavamarino@apple.com>
Incorrect Length constructor used after blending negative Length
https://bugs.webkit.org/show_bug.cgi?id=230873
Reviewed by Antoine Quint.
* fast/borders/border-radius-cubic-bezier-timing-function-negative-value-expected.txt: Added.
* fast/borders/border-radius-cubic-bezier-timing-function-negative-value.html: Added.
2021-10-05 Chris Dumez <cdumez@apple.com>
Authorization header lost on 30x redirects
https://bugs.webkit.org/show_bug.cgi?id=230935
<rdar://problem/83689955>
Reviewed by Darin Adler.
* http/tests/fetch/fetch-redirect-same-origin-authorization-expected.txt: Added.
* http/tests/fetch/fetch-redirect-same-origin-authorization.html: Added.
* http/tests/fetch/resources/dump-authorization-header.py: Added.
Add layout test coverage.
* http/tests/xmlhttprequest/redirections-and-user-headers.html:
Update existing test to reflect behavior change.
2021-10-05 Gabriel Nava Marino <gnavamarino@apple.com>
Unsupported blending of mixed length types leads to nullptr deref when accessing m_value.calc in CSSPrimitiveValue::primitiveType()
https://bugs.webkit.org/show_bug.cgi?id=230929
Reviewed by Reviewed by Darin Adler.
* fast/layoutformattingcontext/fit-content-min-height-animation-expected.txt: Added.
* fast/layoutformattingcontext/fit-content-min-height-animation.html: Added.
2021-10-05 Nikos Mouchtaris <nmouchtaris@apple.com>
radial-gradient does not accept calc values that combine length and percent
https://bugs.webkit.org/show_bug.cgi?id=230388
Reviewed by Simon Fraser.
* css3/calc/css3-radial-gradients-expected.html:
* css3/calc/css3-radial-gradients.html:
2021-10-05 Ayumi Kojima <ayumi_kojima@apple.com>
[ iOS15 WK2 ] http/tests/media/modern-media-controls/overflow-support/playback-speed-live-broadcast.html is a constant timeout.
<rdar://80393995>
Unreviewed test gardening.
* platform/ios-wk2/TestExpectations:
2021-10-05 Simon Fraser <simon.fraser@apple.com>
REGRESSION (r283335): Momentum scrolling is no longer locked to an axis
https://bugs.webkit.org/show_bug.cgi?id=231206
Reviewed by Wenson Hsieh.
* fast/scrolling/mac/momentum-axis-locking-expected.txt: Added.
* fast/scrolling/mac/momentum-axis-locking.html: Added.
2021-10-05 Alan Bujtas <zalan@apple.com>
[IFC][Integration] Enable first-line style for modern line layout
https://bugs.webkit.org/show_bug.cgi?id=231178
Reviewed by Antti Koivisto.
* fast/css/empty-inline-line-height-first-line-expected.txt:
* fast/css/empty-inline-line-height-first-line-quirksmode-expected.txt:
* platform/ios/editing/deleting/delete-at-paragraph-boundaries-002-expected.txt:
* platform/ios/editing/deleting/delete-at-paragraph-boundaries-003-expected.txt:
* platform/ios/editing/deleting/delete-at-paragraph-boundaries-004-expected.txt:
* platform/ios/editing/deleting/delete-at-paragraph-boundaries-005-expected.txt:
* platform/ios/editing/deleting/delete-at-paragraph-boundaries-006-expected.txt:
* platform/ios/editing/deleting/delete-at-paragraph-boundaries-007-expected.txt:
* platform/ios/editing/deleting/delete-at-paragraph-boundaries-008-expected.txt:
* platform/ios/editing/deleting/delete-at-paragraph-boundaries-009-expected.txt:
* platform/ios/editing/deleting/delete-at-paragraph-boundaries-010-expected.txt:
* platform/ios/editing/deleting/delete-at-paragraph-boundaries-011-expected.txt:
* platform/ios/editing/deleting/non-smart-delete-expected.txt:
* platform/ios/editing/inserting/insert-br-quoted-001-expected.txt:
* platform/ios/editing/inserting/insert-br-quoted-002-expected.txt:
* platform/ios/editing/inserting/insert-br-quoted-003-expected.txt:
* platform/ios/editing/inserting/insert-br-quoted-004-expected.txt:
* platform/ios/editing/inserting/insert-br-quoted-005-expected.txt:
* platform/ios/editing/inserting/insert-br-quoted-006-expected.txt:
* platform/ios/editing/inserting/insert-div-026-expected.txt:
* platform/ios/editing/inserting/return-key-with-selection-001-expected.txt:
* platform/ios/editing/inserting/return-key-with-selection-002-expected.txt:
* platform/ios/editing/inserting/return-key-with-selection-003-expected.txt:
* platform/ios/editing/pasteboard/paste-4038267-fix-expected.txt:
* platform/ios/editing/pasteboard/paste-line-endings-001-expected.txt:
* platform/ios/editing/pasteboard/paste-line-endings-002-expected.txt:
* platform/ios/editing/pasteboard/paste-line-endings-003-expected.txt:
* platform/ios/editing/pasteboard/paste-line-endings-004-expected.txt:
* platform/ios/editing/pasteboard/paste-line-endings-005-expected.txt:
* platform/ios/editing/pasteboard/paste-line-endings-006-expected.txt:
* platform/ios/editing/pasteboard/paste-line-endings-007-expected.txt:
* platform/ios/editing/pasteboard/paste-line-endings-008-expected.txt:
* platform/ios/editing/pasteboard/paste-line-endings-009-expected.txt:
* platform/ios/editing/pasteboard/paste-line-endings-010-expected.txt:
* platform/ios/editing/pasteboard/paste-match-style-001-expected.txt:
* platform/ios/editing/pasteboard/paste-match-style-002-expected.txt:
* platform/ios/editing/pasteboard/paste-text-019-expected.txt:
* platform/ios/editing/style/block-styles-007-expected.txt:
* platform/ios/editing/style/style-3998892-fix-expected.txt:
* platform/ios/editing/style/style-boundary-001-expected.txt:
* platform/ios/editing/style/style-boundary-004-expected.txt:
* platform/ios/editing/unsupported-content/list-delete-003-expected.txt:
* platform/ios/editing/unsupported-content/list-type-after-expected.txt:
* platform/ios/fast/css/empty-inline-line-height-first-line-expected.txt:
* platform/ios/fast/css/empty-inline-line-height-first-line-quirksmode-expected.txt:
* platform/ios/fast/css/first-line-text-decoration-expected.txt:
* platform/ios/fast/css/first-line-text-decoration-inherited-from-parent-expected.txt:
* platform/ios/fast/text/firstline/001-expected.txt:
* platform/mac/editing/deleting/delete-at-paragraph-boundaries-002-expected.txt:
* platform/mac/editing/deleting/delete-at-paragraph-boundaries-003-expected.txt:
* platform/mac/editing/deleting/delete-at-paragraph-boundaries-004-expected.txt:
* platform/mac/editing/deleting/delete-at-paragraph-boundaries-005-expected.txt:
* platform/mac/editing/deleting/delete-at-paragraph-boundaries-006-expected.txt:
* platform/mac/editing/deleting/delete-at-paragraph-boundaries-007-expected.txt:
* platform/mac/editing/deleting/delete-at-paragraph-boundaries-008-expected.txt:
* platform/mac/editing/deleting/delete-at-paragraph-boundaries-009-expected.txt:
* platform/mac/editing/deleting/delete-at-paragraph-boundaries-010-expected.txt:
* platform/mac/editing/deleting/delete-at-paragraph-boundaries-011-expected.txt:
* platform/mac/editing/deleting/non-smart-delete-expected.txt:
* platform/mac/editing/inserting/insert-br-quoted-001-expected.txt:
* platform/mac/editing/inserting/insert-br-quoted-002-expected.txt:
* platform/mac/editing/inserting/insert-br-quoted-003-expected.txt:
* platform/mac/editing/inserting/insert-br-quoted-004-expected.txt:
* platform/mac/editing/inserting/insert-br-quoted-005-expected.txt:
* platform/mac/editing/inserting/insert-br-quoted-006-expected.txt:
* platform/mac/editing/inserting/insert-div-026-expected.txt:
* platform/mac/editing/inserting/return-key-with-selection-001-expected.txt:
* platform/mac/editing/inserting/return-key-with-selection-002-expected.txt:
* platform/mac/editing/inserting/return-key-with-selection-003-expected.txt:
* platform/mac/editing/pasteboard/emacs-cntl-y-001-expected.txt:
* platform/mac/editing/pasteboard/emacs-ctrl-k-y-001-expected.txt:
* platform/mac/editing/pasteboard/paste-4038267-fix-expected.txt:
* platform/mac/editing/pasteboard/paste-line-endings-001-expected.txt:
* platform/mac/editing/pasteboard/paste-line-endings-002-expected.txt:
* platform/mac/editing/pasteboard/paste-line-endings-003-expected.txt:
* platform/mac/editing/pasteboard/paste-line-endings-004-expected.txt:
* platform/mac/editing/pasteboard/paste-line-endings-005-expected.txt:
* platform/mac/editing/pasteboard/paste-line-endings-006-expected.txt:
* platform/mac/editing/pasteboard/paste-line-endings-007-expected.txt:
* platform/mac/editing/pasteboard/paste-line-endings-008-expected.txt:
* platform/mac/editing/pasteboard/paste-line-endings-009-expected.txt:
* platform/mac/editing/pasteboard/paste-line-endings-010-expected.txt:
* platform/mac/editing/pasteboard/paste-match-style-001-expected.txt:
* platform/mac/editing/pasteboard/paste-match-style-002-expected.txt:
* platform/mac/editing/pasteboard/paste-text-019-expected.txt:
* platform/mac/editing/style/block-styles-007-expected.txt:
* platform/mac/editing/style/smoosh-styles-001-expected.txt:
* platform/mac/editing/style/smoosh-styles-003-expected.txt:
* platform/mac/editing/style/style-3998892-fix-expected.txt:
* platform/mac/editing/style/style-boundary-001-expected.txt:
* platform/mac/editing/style/style-boundary-002-expected.txt:
* platform/mac/editing/style/style-boundary-003-expected.txt:
* platform/mac/editing/style/style-boundary-004-expected.txt:
* platform/mac/editing/style/style-boundary-005-expected.txt:
* platform/mac/editing/unsupported-content/list-delete-001-expected.txt:
* platform/mac/editing/unsupported-content/list-delete-003-expected.txt:
* platform/mac/editing/unsupported-content/list-type-after-expected.txt:
* platform/mac/editing/unsupported-content/list-type-before-expected.txt:
* platform/mac/editing/unsupported-content/table-delete-002-expected.txt:
* platform/mac/editing/unsupported-content/table-type-after-expected.txt:
* platform/mac/editing/unsupported-content/table-type-before-expected.txt:
* platform/mac/fast/css/first-line-text-decoration-expected.txt:
* platform/mac/fast/css/first-line-text-decoration-inherited-from-parent-expected.txt:
* platform/mac/fast/text/firstline/001-expected.txt:
* platform/win/editing/deleting/delete-at-paragraph-boundaries-002-expected.txt:
* platform/win/editing/deleting/delete-at-paragraph-boundaries-003-expected.txt:
* platform/win/editing/deleting/delete-at-paragraph-boundaries-004-expected.txt:
* platform/win/editing/deleting/delete-at-paragraph-boundaries-005-expected.txt:
* platform/win/editing/deleting/delete-at-paragraph-boundaries-006-expected.txt:
* platform/win/editing/deleting/delete-at-paragraph-boundaries-007-expected.txt:
* platform/win/editing/deleting/delete-at-paragraph-boundaries-008-expected.txt:
* platform/win/editing/deleting/delete-at-paragraph-boundaries-009-expected.txt:
* platform/win/editing/deleting/delete-at-paragraph-boundaries-010-expected.txt:
* platform/win/editing/deleting/delete-at-paragraph-boundaries-011-expected.txt:
* platform/win/editing/deleting/non-smart-delete-expected.txt:
* platform/win/editing/inserting/insert-br-quoted-001-expected.txt:
* platform/win/editing/inserting/insert-br-quoted-002-expected.txt:
* platform/win/editing/inserting/insert-br-quoted-003-expected.txt:
* platform/win/editing/inserting/insert-br-quoted-004-expected.txt:
* platform/win/editing/inserting/insert-br-quoted-005-expected.txt:
* platform/win/editing/inserting/insert-br-quoted-006-expected.txt:
* platform/win/editing/inserting/insert-div-026-expected.txt:
* platform/win/editing/inserting/return-key-with-selection-001-expected.txt:
* platform/win/editing/inserting/return-key-with-selection-002-expected.txt:
* platform/win/editing/inserting/return-key-with-selection-003-expected.txt:
* platform/win/editing/style/block-styles-007-expected.txt:
* platform/win/editing/style/smoosh-styles-001-expected.txt:
* platform/win/editing/style/smoosh-styles-003-expected.txt:
* platform/win/editing/style/style-3998892-fix-expected.txt:
* platform/win/editing/style/style-boundary-001-expected.txt:
* platform/win/editing/style/style-boundary-002-expected.txt:
* platform/win/editing/style/style-boundary-003-expected.txt:
* platform/win/editing/style/style-boundary-004-expected.txt:
* platform/win/editing/style/style-boundary-005-expected.txt:
* platform/win/editing/unsupported-content/list-delete-001-expected.txt:
* platform/win/editing/unsupported-content/list-delete-003-expected.txt:
* platform/win/editing/unsupported-content/list-type-after-expected.txt:
* platform/win/editing/unsupported-content/list-type-before-expected.txt:
* platform/win/editing/unsupported-content/table-delete-002-expected.txt:
* platform/win/editing/unsupported-content/table-type-after-expected.txt:
* platform/win/editing/unsupported-content/table-type-before-expected.txt:
2021-10-05 Martin Robinson <mrobinson@webkit.org>
[css-position-sticky] scrollIntoView should not take into account sticky positioning offsets
https://bugs.webkit.org/show_bug.cgi?id=230689
Reviewed by Simon Fraser.
* platform/ios-wk2/imported/w3c/web-platform-tests/css/css-position/sticky/position-sticky-scrollIntoView-expected.txt: Removed.
2021-10-05 Youenn Fablet <youenn@apple.com>
Removing no longer needed flaky expectations from WebRTC tests
https://bugs.webkit.org/show_bug.cgi?id=231223
Unreviewed.
Update expectations based on results.webkit.org results.
* TestExpectations:
* platform/ios-simulator-wk2/TestExpectations:
* platform/ios-wk2/TestExpectations:
* platform/ios/TestExpectations:
* platform/mac-wk2/TestExpectations:
* platform/mac/TestExpectations:
2021-10-05 Tim Nguyen <ntim@apple.com>
Remove unnecessary autofocus attribute dependencies in tests
https://bugs.webkit.org/show_bug.cgi?id=231219
Reviewed by Antti Koivisto.
The new autofocus behaviour timing happens asynchronously with the page "update rendering" steps.
Some tests are using it solely to focus synchronously on elements. We should just use HTMLElement.focus()
there so they don't rely on the current synchronous timing of autofocus.
* fast/forms/number/number-placeholder-with-unacceptable-value-expected.html:
* fast/forms/number/number-placeholder-with-unacceptable-value.html:
* fast/forms/range/range-type-change-onchange.html:
2021-10-04 Tim Nguyen <ntim@apple.com>
Update ios-wk2 test expectations for select-validity.html WPT
https://bugs.webkit.org/show_bug.cgi?id=231217
Unreviewed test gardening.
* platform/ios-wk2/imported/w3c/web-platform-tests/html/semantics/forms/the-select-element/select-validity-expected.txt:
2021-10-04 Cameron McCormack <heycam@apple.com>
Choose an appropriate color space when converting an SVG image into a NativeImage for canvas drawImage
https://bugs.webkit.org/show_bug.cgi?id=231062
<rdar://problem/83752451>
Reviewed by Simon Fraser.
* TestExpectations:
* platform/ios-14/TestExpectations:
* platform/ios/TestExpectations:
* platform/mac/TestExpectations:
2021-10-04 Cameron McCormack <heycam@apple.com>
Update test expectations for canvas color space tests in simulator
https://bugs.webkit.org/show_bug.cgi?id=231204
<rdar://problem/83865405>
Unreviewed test gardening.
* platform/ios-simulator/TestExpectations:
2021-10-04 Tim Nguyen <ntim@apple.com>
Re-import html/semantics/forms/ WPT
https://bugs.webkit.org/show_bug.cgi?id=231168
Reviewed by Youenn Fablet.
https://github.com/web-platform-tests/wpt/commit/dc29fc4ff101c1c216494a88a1f8a31a0f21d0aa
* TestExpectations:
* tests-options.json:
2021-10-04 Ayumi Kojima <ayumi_kojima@apple.com>
Cleaning up expectations for iOS 15.
https://bugs.webkit.org/show_bug.cgi?id=230968
Unreviewed test gardening.
* platform/ios-14/TestExpectations:
* platform/ios-15/fast/events/ios/keydown-keyup-keypress-keys-in-non-editable-using-chinese-keyboard-expected.txt: Added.
2021-10-04 Eric Hutchison <ehutchison@apple.com>
Remove test expectations since 'crash' has been resolved.
https://bugs.webkit.org/show_bug.cgi?id=230245.
Unreviewed test gardening.
* platform/mac-wk1/TestExpectations:
* platform/mac-wk2/TestExpectations:
2021-10-04 Chris Dumez <cdumez@apple.com>
Use isolated NSURLSessions for each first party registrable domain
https://bugs.webkit.org/show_bug.cgi?id=230750
<rdar://83159358>
Reviewed by Alex Christensen.
This test is now passing more checks on WebKit2 but still completely fails on WebKit1 so I am
adding a WK1-specific baseline.
* platform/mac-wk1/imported/w3c/web-platform-tests/fetch/connection-pool/network-partition-key-expected.txt: Copied from LayoutTests/imported/w3c/web-platform-tests/fetch/connection-pool/network-partition-key-expected.txt.
2021-10-04 Ayumi Kojima <ayumi_kojima@apple.com>
Cleaning up expectations for iOS 15.
https://bugs.webkit.org/show_bug.cgi?id=230968
Unreviewed test gardening.
* platform/ios-14/TestExpectations:
* platform/ios-15/fast/forms/ios/accessory-bar-navigation-expected.txt: Added.
* platform/ios-15/fast/forms/ios/focus-input-in-fixed-expected.txt: Added.
* platform/ios-15/fast/forms/ios/focus-input-in-iframe-expected.txt: Added.
* platform/ios-15/fast/forms/ios/focus-input-via-button-expected.txt: Added.
* platform/ios-15/fast/forms/ios/focus-input-via-button-no-scaling-expected.txt: Added.
* platform/ios-15/fast/forms/ios/focus-long-textarea-expected.txt: Added.
* platform/ios-15/fast/forms/ios/zoom-after-input-tap-expected.txt: Added.
* platform/ios-15/fast/forms/ios/zoom-after-input-tap-wide-input-expected.txt: Added.
* platform/ios/TestExpectations:
* platform/ipad/TestExpectations:
2021-10-04 Lauro Moura <lmoura@igalia.com>
Make preload referrer-img.py compatible with Python 3.9
https://bugs.webkit.org/show_bug.cgi?id=231099
Reviewed by Jonathan Bedard.
Python 3.9 removed[1] the deprecated `base64.decodestring`. We should use
`base64.decodebytes` instead (available since 3.1).
[1] https://bugs.python.org/issue39351
* http/wpt/preload/resources/referrer-img.py: Replace deprecated method.
2021-10-04 Alan Bujtas <zalan@apple.com>
'overflow-wrap: anywhere' should be considered when calculating min-content intrinsic sizes.
https://bugs.webkit.org/show_bug.cgi?id=231152
Reviewed by Javier Fernandez.
* TestExpectations: Progressions.
2021-10-04 Ziran Sun <zsun@igalia.com>
[css-grid] Resync web-platform-tests/css/css-grid tests from upstream
https://bugs.webkit.org/show_bug.cgi?id=231020
Reviewed by Sergio Villar Senin.
* TestExpectations:
2021-10-04 Arcady Goldmints-Orlov <agoldmints@igalia.com>
[GLIB] Mark more font-palette tests as failing. Unreviewed test gardening.
https://bugs.webkit.org/show_bug.cgi?id=231165
* platform/glib/TestExpectations:
2021-10-03 Alan Bujtas <zalan@apple.com>
[LFC][IFC] Do not take hanging whitespace sequence into account while finding expansion opportunities
https://bugs.webkit.org/show_bug.cgi?id=231132
Reviewed by Antti Koivisto.
* TestExpectations:
2021-10-03 Alan Bujtas <zalan@apple.com>
Incorrect preferred width computation when trimmable leading whitespace is present
https://bugs.webkit.org/show_bug.cgi?id=231139
Reviewed by Antti Koivisto.
* TestExpectations: IFC already supports these cases. Preferred width computation produced an incorrect shrink-fit width.
2021-10-03 Simon Fraser <simon.fraser@apple.com>
REGRESSION (r283335): rubber-banding no longer locks to an axis
https://bugs.webkit.org/show_bug.cgi?id=231131
Reviewed by Tim Horton.
* fast/scrolling/mac/rubberband-axis-locking-expected.txt: Added.
* fast/scrolling/mac/rubberband-axis-locking.html: Added.
2021-10-02 Youenn Fablet <youenn@apple.com>
Add support for ServiceWorkerGlobalScope push event handler
https://bugs.webkit.org/show_bug.cgi?id=231008
<rdar://problem/83710760>
Reviewed by Chris Dumez.
* http/wpt/push-api/pushEvent.any.js:
* http/wpt/push-api/pushEvent.any.serviceworker-expected.txt:
2021-10-01 Commit Queue <commit-queue@webkit.org>
Unreviewed, reverting r283293.
https://bugs.webkit.org/show_bug.cgi?id=231116
changing print() broke a lot of random things
Reverted changeset:
"Print values in a nicer way in the jsc shell"
https://bugs.webkit.org/show_bug.cgi?id=230931
https://commits.webkit.org/r283293
2021-10-01 Ayumi Kojima <ayumi_kojima@apple.com>
[ macOS wk2 Release ] http/tests/loading/preload-slow-loading.py is a flaky failure.
https://bugs.webkit.org/show_bug.cgi?id=231088
Unreviewed test gardening.
* platform/mac-wk2/TestExpectations:
2021-10-01 Ayumi Kojima <ayumi_kojima@apple.com>
[ iOS Release & macOS wk2 ] http/tests/misc/repeat-open-cancel.html is a flaky timeout.
https://bugs.webkit.org/show_bug.cgi?id=231097
Unreviewed test gardening.
* platform/ios-wk2/TestExpectations:
* platform/mac-wk2/TestExpectations:
2021-10-01 Yusuke Suzuki <ysuzuki@apple.com>
Disable new incumbent-window until it is fully implemented
https://bugs.webkit.org/show_bug.cgi?id=230261
<rdar://problem/83099726>
Reviewed by Chris Dumez and Geoffrey Garen.
* http/tests/security/frameNavigation/context-for-location-href-gopd-expected.txt:
2021-10-01 Lauro Moura <lmoura@igalia.com>
[GLIB] A few more rebaselines
Unreviewed test gardening.
svg/zoom/page manually tested and working on GTK.
* platform/gtk/TestExpectations:
* platform/gtk/svg/zoom/page/zoom-svg-through-object-with-absolute-size-2-expected.txt:
* platform/gtk/svg/zoom/page/zoom-svg-through-object-with-absolute-size-expected.txt:
* platform/gtk/svg/zoom/page/zoom-svg-through-object-with-percentage-size-expected.txt:
* platform/wpe/scrollingcoordinator/scrolling-tree/coordinated-frame-expected.txt:
* platform/wpe/scrollingcoordinator/scrolling-tree/coordinated-frame-gain-scrolling-ancestor-expected.txt:
* platform/wpe/scrollingcoordinator/scrolling-tree/coordinated-frame-in-fixed-expected.txt:
* platform/wpe/scrollingcoordinator/scrolling-tree/coordinated-frame-lose-scrolling-ancestor-expected.txt:
* platform/wpe/svg/custom/svg-fonts-without-missing-glyph-expected.txt:
* platform/wpe/svg/hixie/intrinsic/003-expected.txt:
* platform/wpe/svg/zoom/page/zoom-svg-through-object-with-absolute-size-2-expected.txt:
* platform/wpe/svg/zoom/page/zoom-svg-through-object-with-absolute-size-expected.txt:
* platform/wpe/svg/zoom/page/zoom-svg-through-object-with-percentage-size-expected.txt:
2021-10-01 Ayumi Kojima <ayumi_kojima@apple.com>
[BigSur wk2 Debug] webgl/1.0.3/conformance/glsl/constructors/glsl-construct-bvec2.html is a flaky timeout.
https://bugs.webkit.org/show_bug.cgi?id=229472
Unreviewed test gardening.
* platform/mac/TestExpectations:
2021-10-01 Ayumi Kojima <ayumi_kojima@apple.com>
[ macOS wk1 ] imported/w3c/web-platform-tests/css/css-multicol/multicol-gap-percentage-001.html is a flaky failure.
https://bugs.webkit.org/show_bug.cgi?id=231103
Unreviewed test gardening.
* platform/mac-wk1/TestExpectations:
2021-10-01 Chris Dumez <cdumez@apple.com>
GC may not know about memory used by AudioBufferSourceNode's buffer
https://bugs.webkit.org/show_bug.cgi?id=230966
Reviewed by Darin Adler.
Add layout test coverage.
* webaudio/AudioBufferSource/audiobuffersource-buffer-gc-expected.txt: Added.
* webaudio/AudioBufferSource/audiobuffersource-buffer-gc.html: Added.
2021-10-01 Ayumi Kojima <ayumi_kojima@apple.com>
[ BigSur wk1 ] printing/css2.1/page-break-after-000.html is a flaky failure.
https://bugs.webkit.org/show_bug.cgi?id=231102
Unreviewed test gardening.
* platform/mac-wk1/TestExpectations:
2021-10-01 Ayumi Kojima <ayumi_kojima@apple.com>
[ macOS wk2 Release ] http/tests/loading/preload-slow-loading.py is a flaky failure.
https://bugs.webkit.org/show_bug.cgi?id=231088
Unreviewed test gardening.
* platform/mac-wk2/TestExpectations:
2021-10-01 Chris Dumez <cdumez@apple.com>
Unreviewed, reverting r283274.
Broke HSTS.CrossOriginRedirect API test
Reverted changeset:
"Use isolated NSURLSessions for each first party registrable
domain"
https://bugs.webkit.org/show_bug.cgi?id=230750
https://commits.webkit.org/r283274
2021-10-01 Simon Fraser <simon.fraser@apple.com>
Fix flaky test: fast/scrolling/mac/scrollbars/overflow-overlay-scrollbar-hovered.html
https://bugs.webkit.org/show_bug.cgi?id=231093
Reviewed by Alan Bujtas.
This test dumped overlay scrollbar state, but that state is timing-dependent since
AppKit changes it via animations. Rather than printing the full state, just
print the expanded and enabled states, since those are the states necessary for
the test to pass.
* fast/scrolling/mac/scrollbars/overflow-overlay-scrollbar-hovered-expected.txt:
* fast/scrolling/mac/scrollbars/overflow-overlay-scrollbar-hovered.html:
2021-10-01 Ayumi Kojima <ayumi_kojima@apple.com>
Regression (r282210/r282211): [ macOS wk2 ] css3/filters/blur-various-radii.html is a flaky image failure.
https://bugs.webkit.org/show_bug.cgi?id=231090
Unreviewed test gardening.
* platform/mac-wk2/TestExpectations:
2021-10-01 Ayumi Kojima <ayumi_kojima@apple.com>
[ macOS ] imported/w3c/web-platform-tests/html/semantics/embedded-content/the-video-element/resize-during-playback.html is a flaky failure.
https://bugs.webkit.org/show_bug.cgi?id=231084
Unreviewed test gardening.
* platform/mac/TestExpectations:
2021-10-01 Eric Hutchison <ehutchison@apple.com>
Reset test expectations regarding bMalloc issue causing flaky crashes on wk1 Debug.
https://bugs.webkit.org/show_bug.cgi?id=230245.
Unreviewed test gardening.
* platform/mac-wk1/TestExpectations:
2021-10-01 Youenn Fablet <youenn@apple.com>
Add support for PushEvent
https://bugs.webkit.org/show_bug.cgi?id=231007
<rdar://problem/83707470>
Reviewed by Chris Dumez.
Skip tests in WK1.
* http/wpt/push-api/pushEvent.any.js: Added.
* http/wpt/push-api/pushEvent.any.serviceworker-expected.txt: Added.
* http/wpt/push-api/pushEvent.any.serviceworker.html: Added.
* platform/mac-wk1/TestExpectations:
* platform/win/TestExpectations:
* platform/wincairo-wk1/TestExpectations:
2021-10-01 Eric Hutchison <ehutchison@apple.com>
[ iOS Mac wk2 Debug ] imported/w3c/web-platform-tests/content-security-policy/generic/policy-inherited-correctly-by-plznavigate.html is a flaky failure.
https://bugs.webkit.org/show_bug.cgi?id=231083.
Unreviewed test gardening.
* platform/ios-wk2/TestExpectations:
* platform/mac-wk2/TestExpectations:
2021-10-01 Kevin Turner <kevin_turner@apple.com>
Add support for pow(), sqrt() and hypot() per https://drafts.csswg.org/css-values-4/#exponent-funcs.
https://bugs.webkit.org/show_bug.cgi?id=203312
Reviewed by Simon Fraser.
Tests performing CSS calculations with pow(), sqrt(), and hypot() with a range of inputs.
* fast/css/calc-parsing-expected.txt:
* fast/css/calc-parsing.html:
2021-09-30 Lauro Moura <lmoura@igalia.com>
[GLIB] Gardening some mediastream consistent failures
Unreviewed test gardening.
* platform/glib/TestExpectations:
* platform/wpe/TestExpectations:
2021-09-30 Sihui Liu <sihui_liu@apple.com>
Make File System Access API available in Worker
https://bugs.webkit.org/show_bug.cgi?id=230805
<rdar://problem/83552511>
Reviewed by Youenn Fablet.
* storage/filesystemaccess/directory-handle-basics-worker-expected.txt: Added.
* storage/filesystemaccess/directory-handle-basics-worker.html: Added.
* storage/filesystemaccess/directory-handle-basics.html:
* storage/filesystemaccess/resources/directory-handle-basics.js: Copied from LayoutTests/storage/filesystemaccess/directory-handle-basics.html.
(finishTest):
(getDirectory):
2021-09-30 John Wilander <wilander@apple.com>
PCM: Change WebIDL attributes from all lowercase to camelcase to match spec and align with Attribution Reporting API
https://bugs.webkit.org/show_bug.cgi?id=230914
<rdar://problem/83639923>
Reviewed by Brent Fulgham.
This patch changes Private Click Measurement's WebIDL attributes from
all lowercase to camelcase to match the spec and align with the
Attribution Reporting API proposal.
References
- Private Click Measurement proposal: https://privacycg.github.io/private-click-measurement/#linkformat
- Attribution Reporting API proposal: https://wicg.github.io/conversion-measurement-api/#monkeypatch-anchor
* http/tests/privateClickMeasurement/anchor-tag-attributes-reflect-expected.txt:
* http/tests/privateClickMeasurement/anchor-tag-attributes-reflect.html:
* http/tests/privateClickMeasurement/anchor-tag-attributes-validation.html:
2021-09-30 Ziran Sun <zsun@igalia.com>
[css-grid] Transfer sizes from the aspect-ratio while resolving min-length for auto repetitions
https://bugs.webkit.org/show_bug.cgi?id=230676
Reviewed by Sergio Villar Senin.
Updated TestExpectations file as two tests with image failures are now passing.
* TestExpectations:
2021-09-30 Arcady Goldmints-Orlov <agoldmints@igalia.com>
[GLIB] Rebaseline a number of tests. Unreviewed test gardening.
https://bugs.webkit.org/show_bug.cgi?id=230996
* platform/glib/http/tests/privateClickMeasurement/attribution-conversion-through-image-redirect-in-new-window-expected.txt: Added.
* platform/glib/http/tests/security/contentSecurityPolicy/report-only-from-header-expected.txt:
* platform/glib/security/block-test-expected.txt:
* platform/gtk/fast/encoding/charset-replacement-expected.txt: Copied from LayoutTests/platform/glib/fast/encoding/charset-replacement-expected.txt.
* platform/gtk/imported/w3c/web-platform-tests/css/css-cascade/layer-counter-style-override-expected.txt: Added.
* platform/gtk/imported/w3c/web-platform-tests/css/cssom/cssstyledeclaration-csstext-expected.txt:
* platform/gtk/imported/w3c/web-platform-tests/css/cssom/getComputedStyle-detached-subtree-expected.txt:
* platform/gtk/inspector/dom/getAccessibilityPropertiesForNode-expected.txt:
* platform/wpe/fast/encoding/charset-replacement-expected.txt: Renamed from LayoutTests/platform/glib/fast/encoding/charset-replacement-expected.txt.
* platform/wpe/imported/w3c/web-platform-tests/css/css-cascade/layer-counter-style-override-expected.txt: Added.
* platform/wpe/imported/w3c/web-platform-tests/css/cssom/cssstyledeclaration-csstext-expected.txt:
* platform/wpe/imported/w3c/web-platform-tests/css/cssom/getComputedStyle-detached-subtree-expected.txt:
2021-09-30 John Wilander <wilander@apple.com>
PCM: Take app bundle ID into consideration when matching triggering events with pending clicks
https://bugs.webkit.org/show_bug.cgi?id=230778
<rdar://problem/83516528>
Reviewed by Alex Christensen.
https://commits.webkit.org/r282884 added app bundle IDs to unattributed
and attributed clicks in PCM. This patch makes sure we take those IDs
into consideration in PCM::Database::attributePrivateClickMeasurement().
* http/tests/privateClickMeasurement/multiple-app-bundle-ids-expected.txt: Added.
* http/tests/privateClickMeasurement/multiple-app-bundle-ids.html: Added.
* http/tests/privateClickMeasurement/resources/util.js:
(tearDownAndFinish):
2021-09-30 Alan Bujtas <zalan@apple.com>
(REGRESSION r282150) Missing background-color on inline box while hovering
https://bugs.webkit.org/show_bug.cgi?id=230977
<rdar://problem/83682736>
Reviewed by Antti Koivisto.
* fast/inline/inline-box-background-dynamic-expected.html: Added.
* fast/inline/inline-box-background-dynamic.html: Added.
2021-09-30 Antti Koivisto <antti@apple.com>
Having unused TextIterator instance shouldn't crash if document is mutated
https://bugs.webkit.org/show_bug.cgi?id=231013
rdar://83690985
Reviewed by Alan Bujtas.
* editing/text-iterator/text-iterator-document-mutation-expected.txt: Added.
* editing/text-iterator/text-iterator-document-mutation.html: Added.
2021-09-30 Lauro Moura <lmoura@igalia.com>
[WPE] Rebaseline a number of text-only text-related failures
Unreviewed test gardening.
Also small spacing diffs like the previous gardening commit.
* platform/wpe/fast/encoding/invalid-UTF-8-expected.txt:
* platform/wpe/fast/events/updateLayoutForHitTest-expected.txt:
* platform/wpe/fast/multicol/vertical-rl/float-multicol-expected.txt:
* platform/wpe/fast/multicol/vertical-rl/nested-columns-expected.txt:
* platform/wpe/fast/table/col-and-colgroup-offsets-expected.txt:
* platform/wpe/fast/text/capitalize-boundaries-expected.txt:
* platform/wpe/fast/text/emoji-expected.txt:
* platform/wpe/fast/text/fallback-traits-fixup-expected.txt:
* platform/wpe/fast/text/fixed-pitch-control-characters-expected.txt:
* platform/wpe/fast/text/in-rendered-text-rtl-expected.txt:
* platform/wpe/fast/text/international/bidi-L2-run-reordering-expected.txt:
* platform/wpe/fast/text/international/bidi-LDB-2-CSS-expected.txt:
* platform/wpe/fast/text/international/bidi-LDB-2-HTML-expected.txt:
* platform/wpe/fast/text/international/bidi-LDB-2-formatting-characters-expected.txt:
* platform/wpe/fast/text/international/bidi-european-terminators-expected.txt:
* platform/wpe/fast/text/international/bidi-ignored-for-first-child-inline-expected.txt:
* platform/wpe/fast/text/international/bidi-innertext-expected.txt:
* platform/wpe/fast/text/international/bidi-listbox-atsui-expected.txt:
* platform/wpe/fast/text/international/bidi-listbox-expected.txt:
* platform/wpe/fast/text/international/bidi-menulist-expected.txt:
* platform/wpe/fast/text/international/bidi-override-expected.txt:
* platform/wpe/fast/text/international/rtl-caret-expected.txt:
* platform/wpe/fast/text/midword-break-after-breakable-char-expected.txt:
* platform/wpe/fast/text/midword-break-before-surrogate-pair-expected.txt:
* platform/wpe/fast/text/orientation-sideways-expected.txt:
* platform/wpe/fast/text/whitespace/pre-wrap-overflow-selection-expected.txt:
2021-09-30 Enrique Ocaña González <eocanha@igalia.com>
[MSE][GStreamer] Allow infinite duration on MSE
https://bugs.webkit.org/show_bug.cgi?id=231017
Reviewed by Alicia Boya Garcia.
* platform/glib/TestExpectations: mediasource-seekable.html now passes.
* platform/glib/imported/w3c/web-platform-tests/media-source/mediasource-changetype-play-implicit-expected.txt: Changed expectations because this test now passes for audio/mpeg <-> audio/mpeg.
2021-09-30 Youenn Fablet <youenn@apple.com>
Layout Test imported/w3c/web-platform-tests/webrtc/RTCPeerConnection-iceConnectionState.https.html is a flaky failure
https://bugs.webkit.org/show_bug.cgi?id=203256
<rdar://problem/56506063>
Reviewed by Eric Carlson.
* TestExpectations:
Mark webrtc/connection-state.html as flaky as it is probably too restrictive and should be reworked.
* platform/mac-wk2/TestExpectations:
Unflake test.
2021-09-29 Youenn Fablet <youenn@apple.com>
Import WPT push api tests
https://bugs.webkit.org/show_bug.cgi?id=230945
Reviewed by Alex Christensen.
* platform/mac-wk1/TestExpectations:
Skip tests in WK1
2021-09-29 Youenn Fablet <youenn@apple.com>
Import WPT notification service worker test
https://bugs.webkit.org/show_bug.cgi?id=230944
Reviewed by Alex Christensen.
* platform/mac-wk1/TestExpectations:
Skip test in WK1
2021-09-29 Saam Barati <sbarati@apple.com>
Print values in a nicer way in the jsc shell
https://bugs.webkit.org/show_bug.cgi?id=230931
Reviewed by Tadeu Zagallo.
* resources/standalone-pre.js:
2021-09-29 Chris Dumez <cdumez@apple.com>
[ iOS Debug ] http/tests/xmlhttprequest/access-control-preflight-credential-sync.html is a flaky crash
https://bugs.webkit.org/show_bug.cgi?id=228305
<rdar://problem/81136891>
Reviewed by Alex Christensen.
Unskip test that should no longer be flaky.
* platform/ios-wk2/TestExpectations:
2021-09-29 Kiet Ho <tho22@apple.com>
Implement the 'ic' unit from CSS Values 4
https://bugs.webkit.org/show_bug.cgi?id=204276
<rdar://problem/57256127>
Reviewed by Myles C. Maxfield.
Added tests for behavior of CSSPrimitiveValue on ic unit.
* TestExpectations: remove ImageOnlyFailure expectations for ic-unit-* tests, now that they should pass.
* fast/css/CSSPrimitiveValue-ic-expected.txt: Added.
* fast/css/CSSPrimitiveValue-ic.html: Added.
2021-09-29 Chris Dumez <cdumez@apple.com>
Use isolated NSURLSessions for each first party registrable domain
https://bugs.webkit.org/show_bug.cgi?id=230750
<rdar://83159358>
Reviewed by Alex Christensen.
This test is now passing more checks on WebKit2 but still completely fails on WebKit1 so I am
adding a WK1-specific baseline.
* platform/mac-wk1/imported/w3c/web-platform-tests/fetch/connection-pool/network-partition-key-expected.txt: Copied from LayoutTests/imported/w3c/web-platform-tests/fetch/connection-pool/network-partition-key-expected.txt.
2021-09-29 Aditya Keerthi <akeerthi@apple.com>
[css-ui] getComputedStyle() must return the specified value for '-webkit-appearance'
https://bugs.webkit.org/show_bug.cgi?id=230916
rdar://83640938
Reviewed by Simon Fraser.
* platform/gtk/imported/w3c/web-platform-tests/css/css-ui/appearance-cssom-001-expected.txt:
* platform/ios-wk2/imported/w3c/web-platform-tests/css/css-ui/appearance-cssom-001-expected.txt:
* platform/wpe/imported/w3c/web-platform-tests/css/css-ui/appearance-cssom-001-expected.txt:
2021-09-29 Robert Jenner <Jenner@apple.com>
[ Catalina+ Debug wk2 ] fast/speechrecognition/start-recognition-after-gum.html is a flaky timeout
https://bugs.webkit.org/show_bug.cgi?id=228209
Unreviewed test gardening.
* platform/mac-wk2/TestExpectations:
2021-09-29 Ayumi Kojima <ayumi_kojima@apple.com>
[ iOS Debug ] fast/selectors/ backtracking tests are timing out.
https://bugs.webkit.org/show_bug.cgi?id=230988
Unreviewed test gardening.
* platform/ios-14/TestExpectations:
* platform/ios-wk2/TestExpectations:
2021-09-29 Ayumi Kojima <ayumi_kojima@apple.com>
[ iOS ] fast/events/ios/viewport-shrink-to-fit-allows-double-tap.html is flaky timing out.
https://bugs.webkit.org/show_bug.cgi?id=230987
Unreviewed test gardening.
* platform/ios-14/TestExpectations:
* platform/ios-wk2/TestExpectations:
2021-09-29 Eric Hutchison <ehutchison@apple.com>
[ BigSur Debug arm64 ] streams/readableStream-then.html is a flaky crash.
https://bugs.webkit.org/show_bug.cgi?id=230984.
Unreviewed test gardening.
* platform/mac/TestExpectations:
2021-09-29 Truitt Savell <tsavell@apple.com>
Unreviewed, reverting r281602.
These tests are working now
Reverted changeset:
"25 webkit imported/w3c/web-platform-tests/css/ layout tests
failing with black bars"
https://commits.webkit.org/r281602
2021-09-29 Eric Hutchison <ehutchison@apple.com>
Update test expectations to include x86 for imported/w3c/web-platform-tests/resource-timing/sizes-redirect-img.html.
https://bugs.webkit.org/show_bug.cgi?id=230862.
Unreviewed test gardening.
* platform/mac/TestExpectations:
2021-09-29 Eric Hutchison <ehutchison@apple.com>
[iOS EWS] imported/w3c/web-platform-tests/content-security-policy/script-src/script-src-strict_dynamic_worker.https.html is a flaky failure.
https://bugs.webkit.org/show_bug.cgi?id=230979.
Unreviewed test gardening.
* platform/ios-14-wk2/TestExpectations:
2021-09-29 Alan Bujtas <zalan@apple.com>
Thin hairline gap displayed for subpixel sized inset box-shadows
https://bugs.webkit.org/show_bug.cgi?id=230814
Reviewed by Simon Fraser.
* fast/box-shadow/hidpi-box-shadow-inset-on-subpixel-position-expected.html: Added.
* fast/box-shadow/hidpi-box-shadow-inset-on-subpixel-position.html: Added.
* platform/win/TestExpectations:
2021-09-29 Eric Hutchison <ehutchison@apple.com>
Fixed incorrect test expectations for imported/w3c/web-platform-tests/mediacapture-streams/MediaStream-default-feature-policy.https.html.
https://bugs.webkit.org/show_bug.cgi?id=230866.
Unreviewed test gardening.
* platform/mac-wk2/TestExpectations:
2021-09-29 Kimmo Kinnunen <kkinnunen@apple.com>
MediaStream canvas.captureStream() fails for WebGL
https://bugs.webkit.org/show_bug.cgi?id=230613
<rdar://82307293>
Reviewed by Youenn Fablet.
Add new expectations, a warning was removed.
CONSOLE MESSAGE: Turning drawing buffer preservation for the WebGL canvas being captured
* fast/mediacapturefromelement/CanvasCaptureMediaStream-webgl-events-expected.txt:
* fast/mediastream/captureStream/canvas3d-expected.txt:
2021-09-29 Youenn Fablet <youenn@apple.com>
[ iOS macOS wk2 ] webrtc/datachannel/mdns-ice-candidates.html is a flaky failure
https://bugs.webkit.org/show_bug.cgi?id=230700
<rdar://problem/83456565>
Reviewed by Eric Carlson.
* platform/mac-wk2/TestExpectations:
* webrtc/datachannel/mdns-ice-candidates.html:
Close connections test after test.
2021-09-29 Ayumi Kojima <ayumi_kojima@apple.com>
[ iOS ] fast/scrolling/ios/click-events-after-long-press-during-momentum-scroll-in-overflow.html is a flaky timeout.
https://bugs.webkit.org/show_bug.cgi?id=230959
Unreviewed test gardening.
* platform/ios-wk2/TestExpectations:
2021-09-29 Ayumi Kojima <ayumi_kojima@apple.com>
[ iOS BigSur ] http/tests/appcache/fail-on-update.html is a flaky timeout.
https://bugs.webkit.org/show_bug.cgi?id=227891
Unreviewed test gardening.
* platform/mac/TestExpectations:
2021-09-29 Aditya Keerthi <akeerthi@apple.com>
Update css-ui WPT
https://bugs.webkit.org/show_bug.cgi?id=230900
rdar://83641111
Reviewed by Simon Fraser.
* TestExpectations:
Remove deleted tests.
* platform/gtk/imported/w3c/web-platform-tests/css/css-ui/appearance-cssom-001-expected.txt:
* platform/ios-wk2/imported/w3c/web-platform-tests/css/css-ui/appearance-cssom-001-expected.txt:
* platform/wpe/imported/w3c/web-platform-tests/css/css-ui/appearance-cssom-001-expected.txt:
2021-09-29 Ayumi Kojima <ayumi_kojima@apple.com>
[iOS] http/tests/appcache/fail-on-update.html is a flaky timeout.
https://bugs.webkit.org/show_bug.cgi?id=227891
Unreviewed test gardening.
* platform/ios-wk2/TestExpectations:
2021-09-29 Eric Carlson <eric.carlson@apple.com>
[Cocoa] Support in-band chapter tracks
https://bugs.webkit.org/show_bug.cgi?id=230380
<rdar://problem/83218578>
Reviewed by Jer Noble.
* media/content/multi-language-chapters.mp4: Added.
* media/track/track-in-band-chapters-expected.txt: Added.
* media/track/track-in-band-chapters.html: Added.
* media/track/track-manual-mode.html: Updated because the movie file this uses has
in-band chapter tracks.
* media/track/track-manual-mode-expected.txt: Ditto.
* platform/glib/TestExpectations: Skipped.
* platform/win/TestExpectations: Skipped.
2021-09-28 Arcady Goldmints-Orlov <agoldmints@igalia.com>
[GLIB] Update test expectations and baselines. Unreviewed test gardening.
https://bugs.webkit.org/show_bug.cgi?id=230927
* platform/glib/TestExpectations:
* platform/glib/imported/w3c/web-platform-tests/content-security-policy/media-src/media-src-7_1-expected.txt: Added.
* platform/glib/imported/w3c/web-platform-tests/content-security-policy/media-src/media-src-7_2-expected.txt: Added.
* platform/glib/imported/w3c/web-platform-tests/content-security-policy/media-src/media-src-7_3.sub-expected.txt: Added.
* platform/glib/imported/w3c/web-platform-tests/content-security-policy/media-src/media-src-redir-bug.sub-expected.txt: Added.
2021-09-28 Truitt Savell <tsavell@apple.com>
Marking more tests crashing with uncaught exception 'NSInvalidArgumentException'
rdar://83592102
Unreviewed test gardening.
* platform/mac/TestExpectations:
2021-09-28 Cameron McCormack <heycam@apple.com>
Preserve color space when structured cloning ImageBitmaps
https://bugs.webkit.org/show_bug.cgi?id=230429
<rdar://problem/83293533>
Reviewed by Sam Weinig.
* fast/storage/serialized-script-value.html: Bump the current version
number.
2021-09-28 Kate Cheney <katherine_cheney@apple.com>
CSP: Implement 'strict-dynamic' source expression
https://bugs.webkit.org/show_bug.cgi?id=184031
<rdar://problem/38900632>
Reviewed by Brent Fulgham.
* TestExpectations:
2021-09-28 Eric Hutchison <ehutchison@apple.com>
[ Catalina BigSur wk1 Debug ] storage/websql/multiple-databases-garbage-collection.html is a flaky crash.
https://bugs.webkit.org/show_bug.cgi?id=230910.
Unreviewed test gardening.
* platform/mac-wk1/TestExpectations:
2021-09-28 Eric Hutchison <ehutchison@apple.com>
[ iOS, Mac ] imported/w3c/web-platform-tests/css/css-cascade/layer-counter-style-override.html is a flaky failure.
https://bugs.webkit.org/show_bug.cgi?id=230905.
Unreviewed test gardening.
* platform/ios-wk2/TestExpectations:
* platform/mac-wk1/TestExpectations:
2021-09-28 Youenn Fablet <youenn@apple.com>
applyConstraints throws OverconstrainedError if specify exact for deviceId
https://bugs.webkit.org/show_bug.cgi?id=230819
<rdar://problem/83577361>
Reviewed by Eric Carlson.
* fast/mediastream/applyConstraints-deviceId-expected.txt: Added.
* fast/mediastream/applyConstraints-deviceId.html: Added.
2021-09-28 Antti Koivisto <antti@apple.com>
[CSS Cascade Layers] Add CSSOM interface
https://bugs.webkit.org/show_bug.cgi?id=230882
Reviewed by Simon Fraser.
* TestExpectations:
2021-09-28 Antti Koivisto <antti@apple.com>
[CSS Cascade Layers] Import more WPT tests
https://bugs.webkit.org/show_bug.cgi?id=230883
Reviewed by Youenn Fablet.
* TestExpectations:
2021-09-27 Eric Hutchison <ehutchison@apple.com>
[ Catalina BigSur wk2 ] imported/w3c/web-platform-tests/mediacapture-streams/MediaStream-default-feature-policy.https.html is a flaky failure and crash.
https://bugs.webkit.org/show_bug.cgi?id=230866.
Unreviewed test gardening.
* platform/mac-wk2/TestExpectations:
2021-09-27 Eric Hutchison <ehutchison@apple.com>
[BigSur wk2 Debug iOS14 ] webrtc/video-mute.html is a flaky failure.
https://bugs.webkit.org/show_bug.cgi?id=230865.
Unreviewed test gardening.
* platform/ios-14-wk2/TestExpectations:
* platform/mac-wk2/TestExpectations:
2021-09-27 Ayumi Kojima <ayumi_kojima@apple.com>
[ macOS wk1 ] webanimations/relative-ordering-of-translate-and-rotate-properties-accelerated.html is a flaky image failure.
https://bugs.webkit.org/show_bug.cgi?id=230863
Unreviewed test gardening.
* platform/mac-wk1/TestExpectations:
2021-09-27 Eric Hutchison <ehutchison@apple.com>
[ Catalina BigSur arm64 ] imported/w3c/web-platform-tests/resource-timing/sizes-redirect-img.html is a flaky failure.
https://bugs.webkit.org/show_bug.cgi?id=230862.
Unreviewed test gardening.
* platform/mac/TestExpectations:
2021-09-27 Truitt Savell <tsavell@apple.com>
6 editing spelling tests crashing with uncaught exception 'NSInvalidArgumentException'
rdar://83592102
Unreviewed test gardening.
* platform/mac/TestExpectations:
2021-09-27 Truitt Savell <tsavell@apple.com>
8 editing/ tests crashing with Assertion failed
rdar://83591040
Unreviewed test gardening.
* platform/mac/TestExpectations:
2021-09-27 Ayumi Kojima <ayumi_kojima@apple.com>
[ iOS 14 & 15 ] fast/images/image-subsampling.html is a flaky image failure.
https://bugs.webkit.org/show_bug.cgi?id=230857
Unreviewed test gardening.
* platform/ios-wk2/TestExpectations:
2021-09-27 Ayumi Kojima <ayumi_kojima@apple.com>
[ iOS 14 ] remote-layer-tree/ios/uiview-tree-basic.html is a flaky failure.
https://bugs.webkit.org/show_bug.cgi?id=230850
Unreviewed test gardening.
* platform/ios-wk2/TestExpectations:
2021-09-27 Tyler Wilcock <tyler_w@apple.com>
[ MacOS ] inspector/dom/getAccessibilityPropertiesForNode.html is failing
https://bugs.webkit.org/show_bug.cgi?id=230840
Reviewed by Ryan Haddad.
Remove `expanded` property from expected output for this test.
Following https://trac.webkit.org/changeset/283078/webkit, we don't
expose expanded in this case anymore.
* inspector/dom/getAccessibilityPropertiesForNode-expected.txt:
2021-09-27 Eric Hutchison <ehutchison@apple.com>
[ Catalina BigSur wk1 Debug ] webrtc/datachannel/datachannel-gc.html is a flaky crash.
https://bugs.webkit.org/show_bug.cgi?id=230848.
Unreviewed test gardening.
* platform/mac-wk1/TestExpectations:
2021-09-27 Eric Hutchison <ehutchison@apple.com>
[ Catalina Debug wk1 EWS ] svg/filters/big-height-filter.svg is a flaky crash.
https://bugs.webkit.org/show_bug.cgi?id=230846.
Unreviewed test gardening.
* platform/mac-wk1/TestExpectations:
2021-09-27 Eric Hutchison <ehutchison@apple.com>
[ Catalina Debug wk1 EWS ] storage/indexeddb/mozilla/cursor-mutation.html is a flaky crash.
https://bugs.webkit.org/show_bug.cgi?id=230844.
Unreviewed test gardening.
* platform/mac-wk1/TestExpectations:
2021-09-27 Lauro Moura <lmoura@igalia.com>
Garden passing flexbox abspos tests since updated in 242101@main
Unreviewed test gardening.
These tests are passing in all platforms according to
results.webkit.org.
* TestExpectations:
2021-09-27 Eric Hutchison <ehutchison@apple.com>
[ Catalina BigSur wk1 Debug ] media/track/audio-track.html is a flaky crash.
https://bugs.webkit.org/show_bug.cgi?id=230842.
Unreviewed test gardening.
* platform/mac-wk1/TestExpectations:
2021-09-27 Youenn Fablet <youenn@apple.com>
Make sure to reset presenting application pid in case of mediaserverd crash
https://bugs.webkit.org/show_bug.cgi?id=230822
<rdar://83474184>
Reviewed by Eric Carlson.
* fast/mediastream/video-rotation-gpu-process-crash-expected.txt: Added.
* fast/mediastream/video-rotation-gpu-process-crash.html: Added.
* platform/ios-simulator/fast/mediastream/video-rotation-gpu-process-crash-expected.png: Added.
* platform/mac/fast/mediastream/video-rotation-gpu-process-crash-expected.png: Added.
2021-09-27 Eric Hutchison <ehutchison@apple.com>
[ Windows ] svg/as-background-image/svg-as-background-body.html is a flaky crash.
https://bugs.webkit.org/show_bug.cgi?id=230838.
Unreviewed test gardening.
* platform/win/TestExpectations:
2021-09-27 Kate Cheney <katherine_cheney@apple.com>
Send CSP violation reports to the DOM window
https://bugs.webkit.org/show_bug.cgi?id=230728
Reviewed by Brent Fulgham.
Unskip tests that are no longer timing out after this fix. Rebaseline
tests that previously expected a different violated directive text.
* TestExpectations:
* http/tests/security/contentSecurityPolicy/1.1/frame-ancestors/report-frame-ancestors-cross-origin-expected.txt:
* http/tests/security/contentSecurityPolicy/1.1/frame-ancestors/report-frame-ancestors-cross-origin-https-expected.txt:
* http/tests/security/contentSecurityPolicy/1.1/frame-ancestors/report-frame-ancestors-same-origin-expected.txt:
* http/tests/security/contentSecurityPolicy/1.1/frame-ancestors/report-frame-ancestors-same-origin-https-expected.txt:
* http/tests/security/contentSecurityPolicy/1.1/report-uri-effective-directive-expected.txt:
* http/tests/security/contentSecurityPolicy/1.1/script-blocked-sends-multiple-reports-expected.txt:
* http/tests/security/contentSecurityPolicy/1.1/scripthash-allowed-by-enforced-policy-and-blocked-by-report-policy-expected.txt:
* http/tests/security/contentSecurityPolicy/1.1/scripthash-allowed-by-enforced-policy-and-blocked-by-report-policy2-expected.txt:
* http/tests/security/contentSecurityPolicy/1.1/scripthash-allowed-by-legacy-enforced-policy-and-blocked-by-report-policy-expected.txt:
* http/tests/security/contentSecurityPolicy/1.1/scripthash-allowed-by-legacy-enforced-policy-and-blocked-by-report-policy2-expected.txt:
* http/tests/security/contentSecurityPolicy/1.1/scripthash-blocked-by-enforced-policy-and-allowed-by-report-policy-expected.txt:
* http/tests/security/contentSecurityPolicy/1.1/scripthash-blocked-by-legacy-enforced-policy-and-blocked-by-report-policy-expected.txt:
* http/tests/security/contentSecurityPolicy/1.1/scripthash-blocked-by-legacy-enforced-policy-and-blocked-by-report-policy2-expected.txt:
* http/tests/security/contentSecurityPolicy/1.1/scriptnonce-blocked-by-enforced-policy-and-allowed-by-report-policy-expected.txt:
* http/tests/security/contentSecurityPolicy/1.1/securitypolicyviolation-block-cross-origin-image-expected.txt:
* http/tests/security/contentSecurityPolicy/1.1/securitypolicyviolation-block-cross-origin-image-from-script-expected.txt:
* http/tests/security/contentSecurityPolicy/1.1/securitypolicyviolation-block-image-expected.txt:
* http/tests/security/contentSecurityPolicy/1.1/securitypolicyviolation-block-image-from-script-expected.txt:
* http/tests/security/contentSecurityPolicy/1.1/securitypolicyviolation-block-image-https-expected.txt:
* http/tests/security/contentSecurityPolicy/1.1/securityviolationpolicy-block-frame-using-child-src-expected.txt:
* http/tests/security/contentSecurityPolicy/1.1/securityviolationpolicy-block-frame-using-default-src-expected.txt:
* http/tests/security/contentSecurityPolicy/1.1/securityviolationpolicy-block-frame-using-frame-src-expected.txt:
* http/tests/security/contentSecurityPolicy/report-and-enforce-expected.txt:
* http/tests/security/contentSecurityPolicy/report-blocked-data-uri-expected.txt:
* http/tests/security/contentSecurityPolicy/report-blocked-file-uri-expected.txt:
* http/tests/security/contentSecurityPolicy/report-blocked-uri-and-do-not-follow-redirect-when-sending-report-expected.txt:
* http/tests/security/contentSecurityPolicy/report-blocked-uri-cross-origin-expected.txt:
* http/tests/security/contentSecurityPolicy/report-blocked-uri-expected.txt:
* http/tests/security/contentSecurityPolicy/report-cross-origin-no-cookies-expected.txt:
* http/tests/security/contentSecurityPolicy/report-cross-origin-no-cookies-when-private-browsing-enabled-expected.txt:
* http/tests/security/contentSecurityPolicy/report-multiple-violations-01-expected.txt:
* http/tests/security/contentSecurityPolicy/report-multiple-violations-02-expected.txt:
* http/tests/security/contentSecurityPolicy/report-only-expected.txt:
* http/tests/security/contentSecurityPolicy/report-only-from-header-expected.txt:
* http/tests/security/contentSecurityPolicy/report-only-upgrade-insecure-expected.txt:
* http/tests/security/contentSecurityPolicy/report-same-origin-with-cookies-expected.txt:
* http/tests/security/contentSecurityPolicy/report-same-origin-with-cookies-when-private-browsing-enabled-expected.txt:
* http/tests/security/contentSecurityPolicy/report-status-code-zero-when-using-https-expected.txt:
* http/tests/security/contentSecurityPolicy/report-uri-expected.txt:
* http/tests/security/contentSecurityPolicy/report-uri-from-child-frame-expected.txt:
* http/tests/security/contentSecurityPolicy/report-uri-from-inline-javascript-expected.txt:
* http/tests/security/contentSecurityPolicy/report-uri-from-javascript-expected.txt:
* http/tests/security/contentSecurityPolicy/report-uri-scheme-relative-expected.txt:
* http/tests/security/contentSecurityPolicy/same-origin-plugin-document-blocked-in-child-window-report-expected.txt:
2021-09-27 Eric Hutchison <ehutchison@apple.com>
[ Catalina BigSur wk1 Debug ] Assertion Failure: WebGL tests are flaky crashes.
https://bugs.webkit.org/show_bug.cgi?id=230835.
Unreviewed test gardening.
* platform/mac-wk1/TestExpectations:
2021-09-27 Eric Hutchison <ehutchison@apple.com>
[ Catalina Debug wk1 EWS] performance-api/performance-observer-order.html is a flaky crash.
https://bugs.webkit.org/show_bug.cgi?id=230833.
Unreviewed test gardening.
* platform/mac-wk1/TestExpectations:
2021-09-27 Eric Hutchison <ehutchison@apple.com>
[ Catalina Debug wk1 EWS ] storage/websql/multiple-transactions-on-different-handles.html is a flaky crash.
https://bugs.webkit.org/show_bug.cgi?id=230831.
Unreviewed test gardening.
* platform/mac-wk1/TestExpectations:
2021-09-27 Eric Hutchison <ehutchison@apple.com>
imported/w3c/web-platform-tests/webrtc/RTCDataChannel-close.html is a flaky failure.
https://bugs.webkit.org/show_bug.cgi?id=230696.
Unreviewed test gardening.
* platform/ios-14-wk2/TestExpectations:
2021-09-27 Martin Robinson <mrobinson@webkit.org>
Mandatory scroll snapping doesn't work correctly in tables with position:sticky
https://bugs.webkit.org/show_bug.cgi?id=227300
<rdar://problem/79971196>
Reviewed by Simon Fraser.
Add a test which exercises the original bug.
* css3/scroll-snap/scroll-snap-drag-scrollbar-thumb-with-sticky-expected.txt: Added.
* css3/scroll-snap/scroll-snap-drag-scrollbar-thumb-with-sticky.html: Added.
* platform/ios/TestExpectations: Skip this test on iOS, which doesn't support thumb dragging.
2021-09-26 Cameron McCormack <heycam@apple.com>
Remove old test files from canvas WPTs that were moved
https://bugs.webkit.org/show_bug.cgi?id=230811
<rdar://problem/83554404>
Reviewed by Tim Horton.
* TestExpectations:
* platform/glib/TestExpectations:
* platform/glib/imported/w3c/web-platform-tests/html/canvas/element/image-smoothing/imagesmoothing-expected.txt: Removed.
* platform/glib/imported/w3c/web-platform-tests/html/canvas/element/imagebitmap/canvas-createImageBitmap-resize-expected.txt: Removed.
* platform/glib/imported/w3c/web-platform-tests/html/canvas/element/imagebitmap/createImageBitmap-drawImage-expected.txt: Removed.
* platform/glib/imported/w3c/web-platform-tests/html/canvas/element/imagebitmap/createImageBitmap-flipY-expected.txt: Removed.
* platform/glib/imported/w3c/web-platform-tests/html/canvas/element/imagebitmap/createImageBitmap-invalid-args-expected.txt: Removed.
* platform/glib/imported/w3c/web-platform-tests/html/canvas/element/imagebitmap/createImageBitmap-serializable-expected.txt: Removed.
* platform/glib/imported/w3c/web-platform-tests/html/canvas/element/imagebitmap/createImageBitmap-transfer-expected.txt: Removed.
* platform/ios-14/TestExpectations:
* platform/ios-simulator-wk2/TestExpectations:
* platform/ios-wk2/TestExpectations:
* platform/ios/TestExpectations:
* platform/mac-wk1/imported/w3c/web-platform-tests/html/canvas/element/imagebitmap/createImageBitmap-flipY-expected.txt: Removed.
* platform/mac/TestExpectations:
2021-09-26 Jean-Yves Avenard <jya@apple.com>
[MSE] appending to the source buffer will not throw when the source buffer is full.
https://bugs.webkit.org/show_bug.cgi?id=230672
rdar://problem/83496195
Reviewed by Eric Carlson.
* media/media-source/media-source-append-buffer-full-quota-exceeded-error-expected.txt:
* media/media-source/media-source-append-buffer-full-quota-exceeded-error.html:
2021-09-26 Lauro Moura <lmoura@igalia.com>
[WPE] Rebaseline a number of text-only failures
Unreviewed test gardening.
Most are 1-pixel differences after some recent LFC-related commits.
* platform/glib/fast/css/getComputedStyle/computed-style-font-family-expected.txt:
* platform/glib/fast/encoding/charset-replacement-expected.txt:
* platform/wpe/TestExpectations:
* platform/wpe/css2.1/t0805-c5518-brdr-t-01-e-expected.txt:
* platform/wpe/css2.1/t0805-c5519-brdr-r-00-a-expected.txt:
* platform/wpe/css2.1/t0805-c5519-brdr-r-01-e-expected.txt:
* platform/wpe/css2.1/t0805-c5520-brdr-b-01-e-expected.txt:
* platform/wpe/css2.1/t0805-c5521-brdr-l-00-a-expected.txt:
* platform/wpe/css2.1/t0805-c5521-brdr-l-01-e-expected.txt:
* platform/wpe/css2.1/t0905-c414-flt-02-c-expected.txt:
* platform/wpe/css2.1/t0905-c414-flt-03-c-expected.txt:
* platform/wpe/css2.1/t0905-c414-flt-04-c-expected.txt:
* platform/wpe/css2.1/t0905-c414-flt-fit-01-d-g-expected.txt:
* platform/wpe/css2.1/t0905-c5525-fltblck-00-d-ag-expected.txt:
* platform/wpe/css2.1/t0905-c5525-fltblck-01-d-expected.txt:
* platform/wpe/css2.1/t0905-c5525-fltcont-00-d-g-expected.txt:
* platform/wpe/css2.1/t0905-c5525-flthw-00-c-g-expected.txt:
* platform/wpe/css2.1/t0905-c5525-fltwidth-00-c-g-expected.txt:
* platform/wpe/css2.1/t0905-c5525-fltwidth-02-c-g-expected.txt:
* platform/wpe/css2.1/t0905-c5525-fltwidth-03-c-g-expected.txt:
* platform/wpe/css2.1/t0905-c5525-fltwrap-00-b-expected.txt:
* platform/wpe/css2.1/t0905-c5526-flthw-00-c-g-expected.txt:
* platform/wpe/css2.1/t090501-c414-flt-01-b-expected.txt:
* platform/wpe/css2.1/t100304-c43-rpl-bbx-01-d-g-expected.txt:
* platform/wpe/css2.1/t1202-counter-04-b-expected.txt:
* platform/wpe/css2.1/t1202-counter-09-b-expected.txt:
* platform/wpe/css2.1/t1202-counters-04-b-expected.txt:
* platform/wpe/css2.1/t1202-counters-09-b-expected.txt:
* platform/wpe/fast/attachment/attachment-select-on-click-expected.txt:
* platform/wpe/fast/attachment/attachment-select-on-click-inside-user-select-all-expected.txt:
* platform/wpe/fast/borders/rtl-border-05-expected.txt:
* platform/wpe/fast/css/font-face-implicit-local-font-expected.txt:
* platform/wpe/fast/css/font-face-locally-installed-expected.txt:
* platform/wpe/fast/css/font-face-opentype-expected.txt:
* platform/wpe/fast/css/font-face-unicode-range-expected.txt:
2021-09-26 Lauro Moura <lmoura@igalia.com>
[GLIB] Update baselines after 242013@main
Unreviewed test gardening.
These tests were updated to use the application bundle ID, which is
not used by the GLIB ports.
* platform/glib/http/tests/contentextensions/block-private-click-measurement-expected.txt: Added.
* platform/glib/http/tests/privateClickMeasurement/attribution-conversion-through-cross-site-image-redirect-expected.txt: Added.
* platform/glib/http/tests/privateClickMeasurement/attribution-conversion-through-fetch-keepalive-expected.txt: Added.
* platform/glib/http/tests/privateClickMeasurement/attribution-conversion-through-image-redirect-ephemeral-expected.txt: Added.
* platform/glib/http/tests/privateClickMeasurement/attribution-conversion-through-image-redirect-with-priority-expected.txt: Added.
* platform/glib/http/tests/privateClickMeasurement/attribution-conversion-through-image-redirect-without-priority-expected.txt: Added.
* platform/glib/http/tests/privateClickMeasurement/conversion-disabled-in-ephemeral-session-expected.txt: Added.
* platform/glib/http/tests/privateClickMeasurement/private-click-measurement-with-source-nonce-null-content-expected.txt: Added.
* platform/glib/http/tests/privateClickMeasurement/private-click-measurement-with-source-nonce-wrong-content-type-expected.txt: Added.
* platform/glib/http/tests/privateClickMeasurement/second-attribution-converted-with-higher-priority-expected.txt: Added.
* platform/glib/http/tests/privateClickMeasurement/second-attribution-converted-with-lower-priority-expected.txt: Added.
* platform/glib/http/tests/privateClickMeasurement/second-conversion-with-higher-priority-expected.txt: Added.
* platform/glib/http/tests/privateClickMeasurement/second-conversion-with-lower-priority-expected.txt: Added.
* platform/glib/http/tests/privateClickMeasurement/store-private-click-measurement-expected.txt: Added.
2021-09-26 Eric Hutchison <ehutchison@apple.com>
[ Catalina Debug wk1 EWS ] media/modern-media-controls/media-controls/media-controls-placard-compressed-metrics.html is a flay crash.
https://bugs.webkit.org/show_bug.cgi?id=230808.
Unreviewed test gardening.
* platform/mac-wk1/TestExpectations:
2021-09-26 Eric Hutchison <ehutchison@apple.com>
[ Catalina Debug wk1 EWS ] Media tests flakily crashing.
https://bugs.webkit.org/show_bug.cgi?id=230807.
Unreviewed test gardening.
* platform/mac-wk1/TestExpectations:
2021-09-26 Antti Koivisto <antti@apple.com>
Line iterator firstRun/lastRun may return runs from wrong lines
https://bugs.webkit.org/show_bug.cgi?id=230770
<rdar://problem/83509753>
Reviewed by Alan Bujtas.
* editing/iterator-line-start-end-expected.txt: Added.
* editing/iterator-line-start-end.html: Added.
2021-09-23 Tim Nguyen <ntim@apple.com>
Make inert nodes invisible to hit testing
https://bugs.webkit.org/show_bug.cgi?id=229330
Reviewed by Antti Koivisto.
Test: LayoutTests/imported/w3c/web-platform-tests/inert/inert-inlines.tentative.html
This adds an internal inherited effectiveInert style property in RenderStyle and starts using it for hit testing checks.
Invalidation is done through style invalidation.
Skipped and removed test expectations for inert event retargeting tests that should soon become irrelevant per
this CSSWG discussion:
https://logs.csswg.org/irc.w3.org/css/2021-09-08/#e1431357
https://lists.w3.org/Archives/Public/www-style/2021Sep/0004.html
Pending WPT PR to remove inert event retargeting tests: https://github.com/web-platform-tests/wpt/pull/30866
* TestExpectations:
* platform/ios-wk2/imported/w3c/web-platform-tests/inert/inert-retargeting-iframe.tentative-expected.txt: Removed.
* platform/ios-wk2/imported/w3c/web-platform-tests/inert/inert-retargeting.tentative-expected.txt: Removed.
2021-09-25 Joanmarie Diggs <jdiggs@igalia.com>
AX: aria-expanded is no longer supported on quite a few roles in ARIA 1.2
https://bugs.webkit.org/show_bug.cgi?id=230609
Reviewed by Chris Fleizach.
* accessibility/aria-expanded-supported-roles.html: Added.
* accessibility/mac/aria-expanded-not-exposed-when-undefined.html: Updated.
* accessibility/mac/aria-expanded-standard-items.html: Updated.
* platform/glib/accessibility/aria-expanded-supported-roles-expected.txt: Added.
* platform/mac/accessibility/aria-expanded-supported-roles-expected.txt: Added.
* platform/win/TestExpectations:
2021-09-24 Eric Hutchison <ehutchison@apple.com>
[ Catalina BigSur Debug ] fast/workers/use-machine-stack.html is a flaky crash.
https://bugs.webkit.org/show_bug.cgi?id=230780.
Unreviewed test gardening.
* platform/mac/TestExpectations:
2021-09-24 Eric Hutchison <ehutchison@apple.com>
[ Catalina Debug wk1 EWS ]transitions/transition-end-event-destroy-renderer.html is a flaky crash.
https://bugs.webkit.org/show_bug.cgi?id=230777.
Unreviewed test gardening.
* platform/mac-wk1/TestExpectations:
2021-09-24 Ayumi Kojima <ayumi_kojima@apple.com>
[ BigSur wk2 Release arm64 ] imported/w3c/web-platform-tests/resource-timing/status-codes-create-entry.html is a flaky failure.
https://bugs.webkit.org/show_bug.cgi?id=230775
Unreviewed test gardening.
* platform/mac-wk2/TestExpectations:
2021-09-24 Eric Hutchison <ehutchison@apple.com>
[ Catalina Debug wk1 EWS ] Multiple WebGL tests are flaky timeouts.
https://bugs.webkit.org/show_bug.cgi?id=230774.
Unreviewed test gardening.
* platform/mac-wk1/TestExpectations:
2021-09-24 Eric Hutchison <ehutchison@apple.com>
[ iOS ] CSS Flexbox tests are constant failure.
https://bugs.webkit.org/show_bug.cgi?id=230773.
Unreviewed test gardening.
* platform/ios-wk2/TestExpectations:
2021-09-24 Eric Hutchison <ehutchison@apple.com>
[ Catalina Debug wk1 EWS ] storage/indexeddb/mozilla/cursors-private.html is a flaky crash.
https://bugs.webkit.org/show_bug.cgi?id=230765.
Unreviewed test gardening.
* platform/mac-wk1/TestExpectations:
2021-09-24 Eric Hutchison <ehutchison@apple.com>
[ Catalina Debug wk1 EWS ] svg/dom/SVGAnimatedListPropertyTearOff-crash-2.html is a flaky crash.
https://bugs.webkit.org/show_bug.cgi?id=230756.
Unreviewed test gardening.
* platform/mac-wk1/TestExpectations:
2021-09-24 Sergio Villar Senin <svillar@igalia.com>
[css-flexbox] Import latest changes from css-flexbox WPT repo
https://bugs.webkit.org/show_bug.cgi?id=230748
Reviewed by Manuel Rego Casasnovas.
* TestExpectations: Added 6 new tests that fail since the import.
2021-09-24 Youenn Fablet <youenn@apple.com>
<video> element rendered incorrectly when provided with a portrait orientation stream in Safari 15
https://bugs.webkit.org/show_bug.cgi?id=229792
<rdar://problem/82776741>
Reviewed by Eric Carlson.
* fast/mediastream/video-rotation-expected.txt: Added.
* fast/mediastream/video-rotation.html: Added.
* platform/ios-simulator/fast/mediastream/video-rotation-expected.png: Added.
* platform/mac/fast/mediastream/video-rotation-expected.png: Added.
2021-09-24 Youenn Fablet <youenn@apple.com>
[IOS 15] Video track does not get unmuted in case of tab was inactive less than ~500 ms
https://bugs.webkit.org/show_bug.cgi?id=230538
<rdar://problem/83355705>
Reviewed by Eric Carlson.
* fast/mediastream/media-stream-video-track-interrupted-expected.txt: Added.
* fast/mediastream/media-stream-video-track-interrupted.html: Added.
2021-09-24 Brandon Stewart <brandonstewart@apple.com>
[RenderTreeUpdater] NULL ptr deref in updateRenderTree
https://bugs.webkit.org/show_bug.cgi?id=230581
Reviewed by Antti Koivisto.
New regression test to handle case where we trigger a text update,
and then switch the node to a new unrendered document.
* fast/dom/Document/clearPendingRenderTreeUpdater-expected.txt: Added.
* fast/dom/Document/clearPendingRenderTreeUpdater.html: Added.
2021-09-24 Sihui Liu <sihui_liu@apple.com>
Add initial support for File System Access API
https://bugs.webkit.org/show_bug.cgi?id=230484
rdar://83405890
Reviewed by Youenn Fablet.
* TestExpectations:
* platform/wk2/TestExpectations:
* storage/filesystemaccess/directory-handle-basics-expected.txt: Added.
* storage/filesystemaccess/directory-handle-basics.html: Added.
2021-09-23 Fujii Hironori <Hironori.Fujii@sony.com>
[WinCairo] Unreviewed test gardening
* platform/wincairo/TestExpectations:
* platform/wincairo/fast/css/font-face-implicit-local-font-expected.txt:
* platform/wincairo/fast/css/font-face-opentype-expected.txt:
* platform/wincairo/fast/text/fixed-pitch-control-characters-expected.txt:
* platform/wincairo/fast/text/whitespace/pre-wrap-overflow-selection-expected.txt:
2021-09-23 Eric Hutchison <ehutchison@apple.com>
[Catalina Release wk1] imported/w3c/web-platform-tests/html/browsers/origin/cross-origin-objects/cross-origin-objects.html is a flaky failure.
https://bugs.webkit.org/show_bug.cgi?id=230729.
Unreviewed test gardening.
* platform/mac-wk1/TestExpectations:
2021-09-23 Eric Hutchison <ehutchison@apple.com>
[ Windows ] fast/images/exif-orientation-composited.html is a flaky image-only failure.
https://bugs.webkit.org/show_bug.cgi?id=230727.
Unreviewed test gardening.
* platform/win/TestExpectations:
2021-09-23 Eric Hutchison <ehutchison@apple.com>
Update test expectations for js/dfg-float64array.html.
https://bugs.webkit.org/show_bug.cgi?id=229594.
Unreviewed test gardening.
* platform/win/TestExpectations:
2021-09-23 Eric Hutchison <ehutchison@apple.com>
[Catalina BigSur wk1 Debug ] resize-observer/delete-observers-in-callbacks.html is a flaky crash.
https://bugs.webkit.org/show_bug.cgi?id=230717.
Unreviewed test gardening.
* platform/mac-wk1/TestExpectations:
2021-09-23 Ayumi Kojima <ayumi_kojima@apple.com>
[ macOS wk1 Debug ] editing/selection/navigation-clears-editor-state.html is a flaky crash.
https://bugs.webkit.org/show_bug.cgi?id=230719
Unreviewed test gardening.
* platform/mac-wk1/TestExpectations:
2021-09-23 Devin Rousso <drousso@apple.com>
Web Inspector: Graphics: add instrumentation for new `CanvasRenderingContext2DSettings`
https://bugs.webkit.org/show_bug.cgi?id=225180
<rdar://problem/77587429>
Reviewed by BJ Burg.
* inspector/canvas/context-attributes-expected.txt:
* inspector/canvas/recording-2d-frameCount-expected.txt:
* inspector/canvas/recording-2d-full-expected.txt:
* inspector/canvas/recording-2d-memoryLimit-expected.txt:
* inspector/canvas/recording-bitmaprenderer-frameCount-expected.txt:
* inspector/canvas/recording-bitmaprenderer-full-expected.txt:
* inspector/canvas/recording-bitmaprenderer-memoryLimit-expected.txt:
* inspector/canvas/recording-html-2d-expected.txt:
* inspector/canvas/recording-webgl-frameCount-expected.txt:
* inspector/canvas/recording-webgl-full-expected.txt:
* inspector/canvas/recording-webgl-memoryLimit-expected.txt:
* inspector/canvas/recording-webgl-snapshots-expected.txt:
* inspector/canvas/recording-webgl2-frameCount-expected.txt:
* inspector/canvas/recording-webgl2-full-expected.txt:
* inspector/canvas/recording-webgl2-memoryLimit-expected.txt:
* inspector/canvas/recording-webgl2-snapshots-expected.txt:
2021-09-23 Eric Hutchison <ehutchison@apple.com>
[ BigSur Debug ]http/tests/inspector/network/resource-initiatorNode.html is a flaky crash/failure.
https://bugs.webkit.org/show_bug.cgi?id=230711.
Unreviewed test gardening.
* platform/mac/TestExpectations:
2021-09-23 Ayumi Kojima <ayumi_kojima@apple.com>
[ iOS macOS Debug ] media/video-ended-seek-crash.html is a flaky timeout.
https://bugs.webkit.org/show_bug.cgi?id=230708
Unreviewed test gardening.
* platform/ios-wk2/TestExpectations:
* platform/mac/TestExpectations:
2021-09-23 Eric Hutchison <ehutchison@apple.com>
LayoutTest memory/memory-pressure-simulation.html is a flaky failure.
https://bugs.webkit.org/show_bug.cgi?id=170629.
Unreviewed test gardening.
* platform/mac-wk2/TestExpectations:
* platform/mac/TestExpectations:
2021-09-23 Eric Hutchison <ehutchison@apple.com>
[ Catalina Debug wk1 ] performance-api/performance-observer-callback-after-gc.html is a flaky crash.
https://bugs.webkit.org/show_bug.cgi?id=230701.
Unreviewed test gardening.
* platform/mac-wk1/TestExpectations:
2021-09-23 Ayumi Kojima <ayumi_kojima@apple.com>
[ iOS macOS wk2 ] webrtc/datachannel/mdns-ice-candidates.html is a flaky failure.
https://bugs.webkit.org/show_bug.cgi?id=230700
Unreviewed test gardening.
* platform/ios-wk2/TestExpectations:
* platform/mac-wk2/TestExpectations:
2021-09-23 Eric Hutchison <ehutchison@apple.com>
[iOS] multiple CSS tests with image-only failures.
https://bugs.webkit.org/show_bug.cgi?id=230695.
Unreviewed test gardening.
* platform/ios-wk2/TestExpectations:
2021-09-23 Ayumi Kojima <ayumi_kojima@apple.com>
[ macOS wk2 ] imported/w3c/web-platform-tests/webrtc/RTCDataChannel-close.html is a flaky failure.
https://bugs.webkit.org/show_bug.cgi?id=230696
Unreviewed test gardening.
* platform/mac-wk2/TestExpectations:
2021-09-23 Ayumi Kojima <ayumi_kojima@apple.com>
[ macOS wk1 Debug ] http/wpt/fetch/navigation-post-to-get-origin.html is a flaky crash.
https://bugs.webkit.org/show_bug.cgi?id=230693
Unreviewed test gardening.
* platform/mac-wk1/TestExpectations:
2021-09-23 Ayumi Kojima <ayumi_kojima@apple.com>
[ BigSur wk2 Release ] imported/w3c/web-platform-tests/html/cross-origin-opener-policy/iframe-popup-unsafe-none-to-unsafe-none.https.html is a flaky failure.
https://bugs.webkit.org/show_bug.cgi?id=230691
Unreviewed test gardening.
* platform/mac-wk2/TestExpectations:
2021-09-22 Jean-Yves Avenard <jya@apple.com>
Make SharedBuffer inherit from ThreadSafeRefCounted
https://bugs.webkit.org/show_bug.cgi?id=230662
rdar://83419269
Revert bug 230644.
Reviewed by Chris Dumez.
* platform/mac-wk1/TestExpectations:
2021-09-22 Andres Gonzalez <andresg_22@apple.com>
Fix for LayoutTests/accessibility/heading-level.html in isolated tree mode.
https://bugs.webkit.org/show_bug.cgi?id=230654
<rdar://problem/83422965>
Reviewed by Chris Fleizach.
Rewrote this test using Promises so that it works in isolated tree mode.
* accessibility/heading-level-expected.txt:
* accessibility/heading-level.html:
2021-09-22 Ayumi Kojima <ayumi_kojima@apple.com>
REGRESSION (r282865?): ASSERTION FAILED: Unsafe to ref/deref from different threads m_isOwnedByMainThread == isMainThread().
https://bugs.webkit.org/show_bug.cgi?id=230644
Unreviewed test gardening.
* platform/mac-wk1/TestExpectations:
2021-09-22 Alan Bujtas <zalan@apple.com>
IFC progression gardening.
Unreviewed.
* TestExpectations: progressed with r282764 and r282872
2021-09-22 Ayumi Kojima <ayumi_kojima@apple.com>
[ iOS & macOS wk2 Debug ] imported/w3c/web-platform-tests/webrtc/simulcast/setParameters-active.https.html is a flaky failure.
https://bugs.webkit.org/show_bug.cgi?id=230653
Unreviewed test gardening.
* platform/ios-wk2/TestExpectations:
* platform/mac-wk2/TestExpectations:
2021-09-22 Eric Hutchison <ehutchison@apple.com>
Update test expectations for js/dfg-uint8clampedarray.html.
https://bugs.webkit.org/show_bug.cgi?id=229594.
Unreviewed test gardening.
* platform/win/TestExpectations:
2021-09-22 Ayumi Kojima <ayumi_kojima@apple.com>
[ BigSur wk2 ] http/tests/cache/disk-cache/shattered-deduplication.html is flaky image failure.
https://bugs.webkit.org/show_bug.cgi?id=230650